program: Gaussian 09
title: 000244183
version: EM64L-G09RevD.01
frameworkgroup: C1[X(C13H14N2O)]
method: RPBEPBE
basis: SDD
operation: Freq
keyword: #p
keyword: freq=noraman
keyword: PBEPBE/SDD
title: #p freq=noraman PBEPBE/SDD
converged: NO YES NO NO
title: Mulliken charges:
elementType: O N N C C C C C C C C C C C C C H H H H H H H H H H H H H H
charge: -0.287505 -0.473969 -0.642696 0.136605 0.194351 -0.510664 -0.503918 -0.412131 -0.399698 0.142696 0.212071 -0.534900 -0.355915 0.332933 -0.384980 0.114252 0.216113 0.216049 0.220586 0.226590 0.208284 0.206853 0.213255 0.208577 0.300545 0.201278 0.232538 0.277238 0.313628 0.331934
chargesum: 0.00000
title: Mulliken charges with hydrogens summed into heavy atoms:
elementType: O N N C C C C C C C C C C C C C
charge: -0.287505 -0.173424 0.002866 0.136605 0.194351 -0.078501 -0.056741 0.003005 0.022133 0.142696 0.212071 -0.333623 -0.123376 0.332933 -0.107742 0.114252
polarizability: 2.41886012e+02 -4.33092956e+00 1.61780397e+02 2.98426047e-01 -1.02252808e+00 7.93037463e+01
1716.lowfreq: -37.0789 -15.2544 -8.0143 -0.0007 0.0002 0.0007 2.4633 63.5259 93.0417
frequency: -37.0220 63.5168 93.0224 122.7681 164.4983 183.7401 240.2023 283.6724 309.3693 317.3121 333.6677 400.0907 408.6089 438.4448 463.5477 467.6411 514.8809 519.0708 538.5750 552.4922 596.6341 603.0155 635.5219 666.9913 687.8895 735.4499 759.9495 767.2830 822.3006 826.1155 838.8200 861.1995 874.7776 907.4800 908.7640 965.3214 978.4514 996.5434 1042.8148 1078.2977 1088.3232 1097.0741 1131.7650 1133.1581 1150.9558 1160.7540 1209.8365 1235.4066 1244.8002 1256.7290 1282.9872 1288.8944 1328.6147 1335.2537 1339.6531 1351.4667 1363.7649 1415.6795 1440.5225 1458.4862 1464.2601 1467.2057 1468.2727 1475.6510 1480.7076 1568.6134 1584.6702 1601.2387 1628.6271 1633.6004 2951.8232 2953.0502 2979.6771 2984.1868 3004.7451 3006.4607 3043.9121 3053.2688 3115.8033 3133.5186 3165.3191 3534.1556 3600.9094 3688.5875
redmass: 4.4210 3.7767 3.2898 4.8967 3.2035 2.9036 4.9616 2.3491 5.0399 3.1688 3.0490 2.1671 3.7154 4.3445 1.7472 1.9493 1.2684 3.3526 1.5409 4.3946 3.9415 2.0907 4.0192 2.8049 4.7085 4.3359 3.4786 4.9333 1.9500 2.2711 1.5145 2.6794 1.7814 3.1766 1.4992 2.2260 1.3326 2.9191 2.1878 1.8260 2.0133 2.3802 1.1526 1.3784 1.4428 2.8545 1.4583 1.3098 2.1696 1.3107 1.6027 1.6716 1.9034 1.4456 1.4063 2.1437 3.1650 4.9507 2.4740 1.1573 1.7302 1.3016 1.6893 1.1367 3.9077 3.6201 3.4803 5.9538 1.9175 6.5925 1.0614 1.0626 1.0658 1.0670 1.0920 1.0938 1.0993 1.1043 1.0905 1.0895 1.0949 1.0445 1.0804 1.1037
irintensity: 17.5751 0.6833 0.2005 1.9799 1.9784 2.5401 14.1751 0.3810 0.0900 0.6465 0.2378 4.3321 2.6797 1.9180 69.5002 74.4036 62.2888 5.1027 120.8773 10.5398 11.8976 8.5212 17.8828 1.1685 2.1197 57.4158 9.8620 2.7600 3.2973 1.4265 26.7403 2.8110 27.3225 1.7649 0.6058 4.2876 1.1113 2.9337 4.0063 0.2497 0.0623 2.7179 0.5325 32.1211 1.8221 13.6148 1.8675 9.5025 12.7149 4.0793 1.1220 15.1097 30.9505 8.3147 5.4594 129.4275 233.4452 0.7476 37.5709 0.9922 6.8468 13.6708 9.4798 7.1524 60.5054 166.3806 23.8654 4.1830 225.5711 36.6707 61.7772 30.3656 28.2773 22.7436 79.0678 8.0383 76.6590 63.0688 22.3592 10.3920 6.4176 32.1234 52.8378 29.6529
temp: 298.150 k
press: 1.00000 atm
elementType: 8 7 7 6 6 6 6 6 6 6 6 6 6 6 6 6 1 1 1 1 1 1 1 1 1 1 1 1 1 1
symmnumber: 1
zpe: 645212.6 jmol-1
zpe.correction: 0.245749 hartree
zpe.thermalcorrener: 0.258283 hartree
zpe.thermalcorrenthalpy: 0.259227 hartree
zpe.thermalcorrgfe: 0.207300 hartree
zpe.sumelectzpe: -687.409242 hartree
zpe.sumelectthermal: -687.396707 hartree
zpe.sumelectthermalent: -687.395763 hartree
zpe.sumelectthermalfe: -687.447690 hartree
dipole: -6.2569 -1.0811 0.0019
dipole: 6.3497
quadrupole: -106.7321 -73.0130 -98.2870
quadrupole: -13.9530 0.1393 -0.4723
quadrupole: -14.0547 19.6644 -5.6096 -13.9530 0.1393 -0.4723
hfenergy: -687.6549901 hartree
pointgroup: C01[X(C13H14N2O1)]
dipole: 2.4662875 -0.3977065 0.0005222 debye
polarizability: 241.7778069|5.2249884|161.8768659|0.5103675|1.398526|79.3154828 unknown
InChI: InChI=1S/C13H14N2O/c14-13(16)8-5-6-12-10(7-8)9-3-1-2-4-11(9)15-12/h5-7,15H,1-4,14H2
charge 0 multiplicity 1
30 atoms
O  -4.780356 -0.048636 -0.020226
N  1.386809 1.843104 0.044614
N  -3.735078 -2.105709 -0.054886
C  1.49698 -0.439001 -0.004656
C  2.253616 0.731734 0.021677
C  2.124398 -1.813129 -0.030622
C  3.75562 0.816975 0.030433
C  3.626919 -1.727177 0.355503
C  4.344171 -0.563257 -0.375419
C  0.100043 -0.045285 -0.002736
C  0.062496 1.397528 0.031292
C  -1.119998 -0.762876 -0.021934
C  -1.15311 2.115248 0.043584
C  -2.346117 -0.054619 -0.008737
C  -2.347242 1.375666 0.023521
C  -3.697851 -0.717718 -0.027448
H  1.59953 -2.497791 0.665141
H  2.026194 -2.263144 -1.041033
H  4.117699 1.602202 -0.663751
H  4.122628 1.095473 1.040814
H  3.714793 -1.572749 1.449702
H  4.129427 -2.68458 0.120674
H  4.232514 -0.698849 -1.469277
H  5.427305 -0.582241 -0.151523
H  1.682769 2.817067 0.062733
H  -1.085103 -1.85914 -0.048845
H  -1.17475 3.210367 0.068696
H  -3.322414 1.872615 0.032039
H  -2.903251 -2.689847 -0.060388
H  -4.65304 -2.54763 -0.06874
