program: Gaussian 09
title: 000244163
version: EM64L-G09RevD.01
frameworkgroup: C1[X(C11H14O2)]
method: RPBEPBE
basis: SDD
operation: Freq
keyword: #pfreq=noraman
keyword: PBEPBE/SDD
title: #p freq=noraman PBEPBE/SDD
converged: YES YES NO NO
title: Mulliken charges:
elementType: O O C C C C C C C C C C C H H H H H H H H H H H H H H
charge: -0.413863 -0.241532 -0.580138 -0.390506 0.380794 0.281323 -0.490907 -0.409834 -0.402796 -0.843230 -0.248455 -0.240436 0.195389 0.204937 0.241938 0.224449 0.232129 0.247728 0.261056 0.228730 0.227426 0.259802 0.222247 0.231306 0.222780 0.223563 0.376101
chargesum: 0.00000
title: Mulliken charges with hydrogens summed into heavy atoms:
elementType: O O C C C C C C C C C C C
charge: -0.037762 -0.241532 -0.133263 0.066073 0.380794 0.281323 0.017876 -0.181104 -0.175370 -0.129875 -0.025675 -0.016873 0.195389
polarizability: 1.60224682e+02 -1.13891096e+00 1.28291727e+02 1.09802721e+01 3.17214658e+00 7.29906580e+01
1716.lowfreq: -8.8582 0.0003 0.0006 0.0007 6.7097 13.3413 32.3768 36.1342 54.9084
frequency: 32.2685 36.1189 54.8557 92.0122 108.5396 132.1819 189.9380 233.5756 272.8332 296.8068 321.9662 404.2767 448.6413 464.9714 495.8315 513.9275 546.9214 576.2077 613.6647 643.9534 724.7975 741.9052 749.0531 766.1647 819.4239 838.3972 871.5886 873.6791 943.8558 983.8319 990.6578 998.3408 1026.3325 1039.0439 1045.6104 1055.5942 1078.0987 1119.1639 1161.2575 1172.6660 1189.6973 1203.6605 1233.4704 1253.6270 1279.0162 1294.9716 1301.4891 1349.1045 1364.1783 1377.1664 1405.2155 1432.9501 1433.7521 1462.1164 1471.9410 1477.8528 1484.9706 1495.5700 1588.2739 1614.0571 1661.7251 2973.1901 2984.7526 2990.4008 3004.7225 3041.1093 3050.0411 3052.7438 3070.4467 3085.4360 3107.5028 3116.0178 3134.1768 3156.7705 3509.7374
redmass: 7.5459 4.6469 4.5293 3.4286 4.3415 1.0521 3.0842 2.2316 3.4748 3.1773 2.5917 2.5273 3.1249 3.6866 2.0340 3.5177 3.9965 4.1625 3.9855 1.3769 3.3927 1.8184 1.6258 1.9228 2.9119 2.5199 2.3853 1.3379 1.3951 1.3222 1.6244 1.9419 2.8060 1.8926 1.9528 2.2255 1.8139 1.8811 1.2500 1.0597 2.2733 1.3303 2.2642 1.6594 1.3311 1.3972 1.2403 1.4742 1.7981 5.5697 1.2313 1.3901 1.4654 1.0816 1.1943 1.0710 2.3139 1.1080 6.3975 6.2498 7.8878 1.0398 1.0623 1.0622 1.0622 1.0974 1.0963 1.0937 1.1032 1.0998 1.0870 1.0880 1.0929 1.1006 1.0639
irintensity: 0.6385 0.5416 0.9377 0.4866 0.9682 0.3984 1.2987 1.4030 1.8951 3.0872 0.2916 0.4635 13.8594 23.3849 26.1764 7.9667 9.1732 6.1779 0.9651 132.5868 0.3778 43.2450 9.9353 39.4355 0.6809 0.6996 5.6257 0.1690 0.3985 0.0058 2.2858 1.5117 125.4215 112.5199 72.0406 8.5099 28.5608 34.5412 16.6180 0.3928 0.8434 4.4167 1.1223 10.7854 2.9440 1.0798 4.1408 2.9713 50.9881 0.2153 13.6270 25.8886 12.4951 1.4938 13.5895 29.3945 26.3254 9.2592 2.0419 1.4860 197.6118 22.9014 22.3828 27.3281 23.1382 1.5688 16.9055 13.2010 34.3941 14.1755 16.0751 4.7137 35.9128 34.5811 23.7549
temp: 298.150 k
press: 1.00000 atm
elementType: 8 8 6 6 6 6 6 6 6 6 6 6 6 1 1 1 1 1 1 1 1 1 1 1 1 1 1
symmnumber: 1
zpe: 586952.6 jmol-1
zpe.correction: 0.223558 hartree
zpe.thermalcorrener: 0.236570 hartree
zpe.thermalcorrenthalpy: 0.237514 hartree
zpe.thermalcorrgfe: 0.182489 hartree
zpe.sumelectzpe: -577.060399 hartree
zpe.sumelectthermal: -577.047387 hartree
zpe.sumelectthermalent: -577.046443 hartree
zpe.sumelectthermalfe: -577.101468 hartree
dipole: -1.3848 -1.0366 -0.0196
dipole: 1.7299
quadrupole: -69.8407 -74.3239 -79.5426
quadrupole: -0.2946 2.2822 -1.0033
quadrupole: 4.7284 0.2452 -4.9735 -0.2946 2.2822 -1.0033
hfenergy: -577.2839574 hartree
pointgroup: C01 [X(C11H14O2)]
dipole: -0.5488716 -0.4023023 0.0111288 debye
polarizability: 160.2409596|-0.9703892|128.4800153|10.8966905|0.6125101|72.7860918 unknown
InChI: InChI=1S/C11H14O2/c1-9-5-2-3-6-10(9)7-4-8-11(12)13/h2-3,5-6,12H,4,7-8H2,1H3
charge 0 multiplicity 1
27 atoms
O  -4.704487 -0.082434 -0.308084
O  -2.943986 1.35664 0.145882
C  -0.386674 -0.655835 -0.571547
C  -1.168768 -0.882467 0.754266
C  1.087327 -0.37234 -0.313911
C  1.561282 0.958219 -0.093267
C  -2.681647 -1.082524 0.538071
C  2.002081 -1.453386 -0.241132
C  2.935563 1.15093 0.201203
C  0.63628 2.161314 -0.199246
C  3.368408 -1.247447 0.051205
C  3.837554 0.065734 0.276377
C  -3.395919 0.189783 0.11944
H  -0.492378 -1.559859 -1.203368
H  -0.854449 0.182519 -1.118606
H  -0.755639 -1.770937 1.267907
H  -1.0056 -0.019817 1.426232
H  -2.887941 -1.861276 -0.220386
H  -3.168857 -1.432896 1.470076
H  1.634105 -2.471966 -0.421297
H  3.302788 2.170759 0.371022
H  -0.30743 2.027221 0.358695
H  1.133073 3.072012 0.177501
H  0.349925 2.352018 -1.252423
H  4.057155 -2.098475 0.099807
H  4.894337 0.244862 0.505268
H  -5.154407 0.772246 -0.551384
