program: Gaussian 09
title: 000244173
version: EM64L-G09RevD.01
frameworkgroup: C1[X(C13H23BrO4)]
method: RPBEPBE
basis: SDD
operation: Freq
keyword: #p
keyword: freq=noraman
keyword: PBEPBE/SDD
title: #p freq=noraman PBEPBE/SDD
converged: YES YES NO NO
title: Mulliken charges:
elementType: Br O O O O C C C C C C C C C C C C C H H H H H H H H H H H H H H H H H H H H H H H
charge: -0.054354 -0.265543 -0.265085 -0.232338 -0.231156 -0.402697 -0.408596 -0.368275 -0.310055 -0.382648 -0.312309 0.253147 0.228604 -0.694443 -0.265086 -0.262593 -0.661097 -0.663441 0.212752 0.240813 0.228713 0.219124 0.199958 0.190510 0.278538 0.199795 0.203524 0.225303 0.226932 0.278204 0.279387 0.224677 0.233735 0.227234 0.235658 0.216682 0.228172 0.252740 0.219455 0.227451 0.248606
chargesum: 0.00000
title: Mulliken charges with hydrogens summed into heavy atoms:
elementType: Br O O O O C C C C C C C C C C C C C
charge: -0.054354 -0.265543 -0.265085 -0.232338 -0.231156 0.050868 0.039241 0.022193 -0.031518 0.020672 0.139926 0.253147 0.228604 -0.136853 0.193325 0.200300 0.036498 0.032071
polarizability: 2.21468760e+02 4.35819279e+00 1.58397492e+02 -1.01956068e+01 2.42851072e+00 1.33729377e+02
1716.lowfreq: -35.8276 -11.0989 -4.0961 -3.4087 0.0002 0.0005 0.0008 5.9730 15.4612
frequency: -32.3326 -9.2667 15.3136 28.8708 37.5950 48.6423 53.6510 66.1654 71.7612 83.2666 95.0585 98.0922 118.2603 137.2112 144.3418 168.1719 191.7054 210.0865 216.4795 232.6668 269.6851 292.3595 323.5331 340.2205 368.0743 400.1902 433.5939 438.4228 520.4346 559.5077 614.3776 652.0176 707.8397 725.0522 729.2027 742.1383 764.9857 785.5131 805.9348 817.8060 832.1998 844.4074 847.1293 913.6119 964.2464 971.7869 1005.1275 1014.1148 1016.2451 1033.4823 1048.2361 1072.7021 1079.5633 1089.2873 1092.8254 1096.9516 1104.5619 1137.1879 1152.5991 1156.2298 1158.4312 1201.3099 1214.0600 1226.1483 1257.4214 1260.7460 1277.1621 1277.6385 1281.4667 1289.5023 1297.3592 1301.6681 1324.9642 1332.6957 1347.8453 1354.4714 1356.4317 1365.8316 1389.6809 1390.8976 1447.7350 1452.0499 1455.7870 1458.0526 1461.3906 1462.2454 1463.5237 1464.0986 1474.5809 1484.0769 1484.7586 1484.9056 1639.4272 1644.0661 2953.8491 2963.9576 2984.9539 2991.9038 2992.6786 2993.8333 2995.3416 2997.4808 3021.8979 3022.3978 3029.4110 3032.8932 3038.5296 3047.6061 3057.7179 3067.8502 3088.3035 3089.1435 3094.4758 3094.4877 3120.4672 3121.2409 3132.8966
redmass: 1.8332 4.2796 5.0708 4.9490 3.0926 3.3203 4.2435 3.9199 3.1315 2.3083 5.5830 4.9308 2.8395 2.1297 4.0813 2.6879 3.3676 1.3885 2.2562 1.7325 2.7058 2.7097 3.5891 5.2772 4.2285 3.8547 3.3896 3.4996 4.2205 7.0725 4.9495 3.2640 2.7791 1.5271 1.9694 1.3096 1.5282 1.5838 1.3643 1.6825 3.5714 3.0937 1.5461 2.0089 1.6732 2.5579 3.4830 3.3094 3.1725 3.3409 1.1215 2.5333 3.5230 3.5668 2.4536 2.2487 2.6764 1.4700 2.3675 1.6946 1.6939 1.3682 1.4608 1.4396 1.3051 1.3376 1.1230 1.1190 1.0993 1.1574 1.1378 1.3105 1.4003 1.3741 1.4858 1.3010 1.3447 1.5065 1.2320 1.2317 1.1021 1.0822 1.0964 1.0901 1.0704 1.0428 1.0439 1.0750 1.0960 1.0521 1.0999 1.0518 8.9636 9.9480 1.0585 1.0588 1.0603 1.0703 1.0361 1.0361 1.0626 1.0844 1.0998 1.0834 1.0597 1.0597 1.1009 1.0562 1.1044 1.1041 1.0974 1.0974 1.1030 1.1031 1.1059 1.1066 1.1112
irintensity: 0.8782 0.7380 0.1147 0.3107 0.8188 0.3173 1.3759 3.1428 0.4808 0.3378 0.8131 0.4333 0.1032 0.3284 1.1180 1.8661 0.3717 2.8980 9.8524 0.7186 4.6461 10.4260 11.8175 6.6722 5.0316 1.5285 1.7316 5.0496 2.3849 10.6816 43.0819 3.4541 4.3970 20.1809 2.4373 0.6959 11.6381 4.3657 6.5859 5.0201 2.5850 5.1510 0.3489 4.8419 7.1896 4.7069 15.3050 22.1088 81.9739 18.1020 5.3278 3.1725 12.8259 93.9610 183.8129 21.3486 183.9200 11.8223 217.9357 25.6315 29.9354 51.8201 4.7346 6.6780 44.9818 68.6698 7.7437 3.5400 4.3681 10.0621 12.4706 0.6126 37.2127 22.1664 2.3639 1.3065 8.0469 2.6305 23.9183 23.5882 2.4404 8.8842 11.2224 12.6256 0.6993 14.2504 13.8414 2.0155 0.0615 10.9418 24.2585 11.0298 106.7628 197.9765 8.5976 38.0279 4.9229 28.7653 19.7309 19.3608 17.1107 26.0218 19.5141 10.0834 30.9014 24.4971 0.6716 23.6358 19.5161 77.0181 35.0641 32.6324 0.5282 1.5833 32.2867 30.0639 17.9947
temp: 298.150 k
press: 1.00000 atm
elementType: 35 8 8 8 8 6 6 6 6 6 6 6 6 6 6 6 6 6 1 1 1 1 1 1 1 1 1 1 1 1 1 1 1 1 1 1 1 1 1 1 1
symmnumber: 1
zpe: 900168.8 jmol-1
zpe.correction: 0.342856 hartree
zpe.thermalcorrener: 0.363942 hartree
zpe.thermalcorrenthalpy: 0.364887 hartree
zpe.thermalcorrgfe: 0.288093 hartree
zpe.sumelectzpe: -822.098145 hartree
zpe.sumelectthermal: -822.077059 hartree
zpe.sumelectthermalent: -822.076115 hartree
zpe.sumelectthermalfe: -822.152909 hartree
dipole: 5.2675 1.2322 0.4353
dipole: 5.4272
quadrupole: -129.7492 -108.4379 -119.3285
quadrupole: -1.2626 1.9710 2.1220
quadrupole: -10.5773 10.7340 -0.1567 -1.2626 1.9710 2.1220
hfenergy: -822.4410013 hartree
pointgroup: C01 [X(C13H23Br1O4)]
dipole: 2.0075662 -0.6234016 -0.374515 debye
polarizability: 221.8506006|-8.1111962|159.2991756|1.1211886|2.178288|132.445853 unknown
InChI: InChI=1S/C13H23BrO4/c1-3-17-12(15)11(13(16)18-4-2)9-7-5-6-8-10-14/h11H,3-10H2,1-2H3
charge 0 multiplicity 1
41 atoms
Br -8.139621 0.610466 0.772207
O  1.825573 -2.318254 -1.059471
O  2.99846 1.149276 -0.240017
O  1.393873 -1.269655 0.982134
O  0.993016 2.329968 -0.385847
C  -1.329926 0.090441 -0.236355
C  -0.39837 0.029946 -1.46742
C  -2.813386 0.198801 -0.654462
C  1.126796 -0.030658 -1.156513
C  -3.772202 0.274914 0.556186
C  -5.257513 0.380975 0.120959
C  1.469797 -1.226174 -0.265405
C  1.647848 1.276992 -0.548358
C  -6.182266 0.475845 1.334558
C  2.154183 -3.588872 -0.335962
C  3.670588 2.344562 0.361876
C  3.626736 -3.602083 0.081814
C  4.189932 3.280409 -0.73275
H  -1.189713 -0.808072 0.395495
H  -1.056852 0.963865 0.384161
H  -0.569039 0.929755 -2.089018
H  -0.653451 -0.851242 -2.087891
H  -2.952812 1.100622 -1.285856
H  -3.088576 -0.672678 -1.285116
H  1.669952 -0.177949 -2.109258
H  -3.631319 -0.622565 1.193092
H  -3.500607 1.150922 1.180139
H  -5.5314 -0.501035 -0.488564
H  -5.394064 1.27206 -0.520694
H  -6.143606 -0.419833 1.974267
H  -6.007466 1.382597 1.934584
H  1.922133 -4.373277 -1.073781
H  1.486672 -3.675028 0.539527
H  4.486409 1.906835 0.958429
H  2.947175 2.855303 1.021028
H  3.874321 -4.575701 0.544128
H  4.285355 -3.456227 -0.791569
H  3.830519 -2.808003 0.819356
H  4.75523 4.112548 -0.273427
H  4.865085 2.744699 -1.422195
H  3.354137 3.710309 -1.309809
