program: Gaussian 09
title: 000240650
version: EM64L-G09RevD.01
frameworkgroup: C1[X(C13H20O4S2)]
method: RPBEPBE
basis: SDD
operation: Freq
keyword: #p
keyword: freq=noraman
keyword: PBEPBE/SDD
title: #p freq=noraman PBEPBE/SDD
converged: NO YES NO NO
title: Mulliken charges:
elementType: S S O O O O C C C C C C C C C C C C C H H H H H H H H H H H H H H H H H H H H
charge: 0.940374 0.910491 -0.553675 -0.536922 -0.558845 -0.576720 -0.582670 -0.385049 -0.541721 -0.532411 -0.498314 0.459809 -0.635705 -0.630843 -0.405291 -0.405094 -0.241116 -0.237308 -0.247375 0.350994 0.277156 0.242719 0.279652 0.231788 0.285636 0.319317 0.266256 0.294141 0.226840 0.283683 0.250635 0.235569 0.263991 0.252889 0.272214 0.231939 0.232306 0.228667 0.231993
chargesum: 0.00000
title: Mulliken charges with hydrogens summed into heavy atoms:
elementType: S S O O O O C C C C C C C C C C C C C
charge: 0.940374 0.910491 -0.553675 -0.536922 -0.558845 -0.576720 -0.231676 0.134826 -0.030281 0.072542 0.062082 0.459809 0.125454 0.121606 -0.133078 -0.173156 -0.008809 -0.008641 -0.015382
polarizability: 2.58517783e+02 -1.87241127e+01 1.82230317e+02 8.62886983e+00 1.40214840e+01 1.75621498e+02
1716.lowfreq: -20.6017 -12.0279 -5.0756 -0.0019 -0.0017 -0.0011 7.6369 24.5812 30.2500
frequency: -10.6575 24.1372 30.1471 47.4718 50.8554 64.3393 81.3279 98.1827 111.5879 117.1710 144.7593 152.9378 172.1160 177.0643 178.2928 189.3407 203.4168 220.1839 223.7896 269.1128 274.3350 290.5410 306.9213 337.2423 348.8697 358.4336 402.3176 403.2994 450.1136 471.8707 476.7959 530.9422 537.9287 562.7112 615.6984 623.6380 702.2660 738.8377 769.0018 777.6070 785.5576 790.3868 808.2552 852.7347 863.8648 882.9773 907.5402 910.2460 948.2768 953.1307 965.0452 969.4671 974.8657 989.9889 996.5053 1026.5625 1032.0820 1046.6896 1061.9220 1073.4079 1075.9631 1084.9517 1114.3011 1162.4402 1172.6165 1189.8114 1195.0278 1219.0370 1229.1918 1235.5717 1244.4056 1258.3349 1267.4269 1317.8346 1323.1247 1351.0910 1379.8349 1391.4918 1394.8555 1411.0538 1428.5633 1440.2611 1440.9216 1451.8323 1456.4116 1465.0871 1478.3807 1484.4195 1484.8065 1588.0362 1610.7472 2964.8691 2987.0258 2992.7864 3002.7309 3006.6404 3016.9802 3042.6852 3081.2185 3084.6667 3086.8193 3088.0949 3103.2623 3105.9385 3108.4461 3122.5496 3127.4351 3139.7194 3143.2340 3156.0107 3168.4115
redmass: 5.0810 4.4655 2.7331 5.0166 4.0684 4.3645 2.7777 6.8842 3.6415 5.4956 1.9817 2.5558 4.9394 8.9231 3.7770 1.6073 2.2619 2.5910 4.0705 3.4776 3.1531 2.6050 5.5446 5.4271 6.0604 3.1181 3.6976 2.9114 5.3322 4.8877 3.9806 7.1860 5.1108 4.5595 6.0792 4.3862 2.0215 2.0519 2.2611 4.0957 1.3025 2.5813 2.3026 1.2879 2.2725 4.6018 3.8710 1.7032 2.1093 2.0588 1.5562 1.7630 1.4316 5.6026 1.3147 2.1849 1.3211 1.2427 2.7008 2.4283 1.9175 2.4968 1.1930 1.1398 1.0546 1.2134 1.3154 1.6677 1.2654 1.2621 1.2296 1.2706 1.1929 1.3517 1.3761 1.4090 5.6584 1.1711 1.1689 1.1174 1.1007 2.0395 1.0910 1.0354 1.0353 1.1225 1.0537 1.4820 1.3471 5.9443 5.9723 1.0604 1.0380 1.0365 1.0735 1.0599 1.0920 1.0564 1.0954 1.0956 1.0964 1.0880 1.1051 1.0881 1.1024 1.1059 1.0864 1.0925 1.1111 1.0960 1.0995
irintensity: 2.3590 1.0048 1.3772 1.0494 1.1494 2.7223 1.1320 2.5812 2.7052 5.2972 0.1047 2.9775 1.7741 1.1255 2.4492 4.0137 1.6492 4.2440 31.8799 15.0244 14.6582 0.9123 13.1430 5.8920 19.5393 0.3875 10.7215 1.0737 6.5942 14.9941 13.6020 19.8722 53.6398 37.3340 1.3865 6.4648 44.5526 47.3483 23.8400 48.7311 14.2308 0.8520 84.7399 2.9891 3.1996 46.1307 102.9637 6.7320 19.2225 10.6432 35.7353 23.4955 0.4132 0.1254 0.3602 5.6431 6.5904 4.7565 8.3069 0.4797 3.2596 14.5785 15.8395 1.3606 0.0877 1.5053 4.1125 1.7775 9.3319 4.0412 22.6085 1.2898 8.7318 1.9692 4.2247 2.1596 1.6886 25.6516 37.1427 0.7069 17.5816 13.2514 10.9324 12.9429 17.2004 20.1385 14.1614 18.3351 7.5124 1.4706 6.7757 9.0264 15.5464 9.1359 9.6823 18.9608 6.1179 9.4579 3.4620 1.8512 5.1749 1.0612 3.9303 11.0467 8.8683 0.3564 0.5457 23.9267 0.4263 27.4438 8.1443
temp: 298.150 k
press: 1.00000 atm
elementType: 16 16 8 8 8 8 6 6 6 6 6 6 6 6 6 6 6 6 6 1 1 1 1 1 1 1 1 1 1 1 1 1 1 1 1 1 1 1 1
symmnumber: 1
zpe: 803008.1 jmol-1
zpe.correction: 0.305850 hartree
zpe.thermalcorrener: 0.327929 hartree
zpe.thermalcorrenthalpy: 0.328873 hartree
zpe.thermalcorrgfe: 0.253690 hartree
zpe.sumelectzpe: -1602.601274 hartree
zpe.sumelectthermal: -1602.579195 hartree
zpe.sumelectthermalent: -1602.578250 hartree
zpe.sumelectthermalfe: -1602.653433 hartree
dipole: -4.8253 2.3688 -1.9752
dipole: 5.7268
quadrupole: -124.9531 -140.1116 -129.6809
quadrupole: 4.1239 11.9947 3.2742
quadrupole: 6.6288 -8.5298 1.9010 4.1239 11.9947 3.2742
hfenergy: -1602.9071232 hartree
pointgroup: C01 [X(C13H20O4S2)]
dipole: -1.141011 -1.8365605 0.6336402 debye
polarizability: 219.7062096|40.0722043|225.9840068|-8.1058524|12.4806418|170.6793827 unknown
InChI: InChI=1S/C13H20O4S2/c1-3-18(14,15)13(19(16,17)4-2)11-10-12-8-6-5-7-9-12/h5-9,13H,3-4,10-11H2,1-2H3
charge 0 multiplicity 1
39 atoms
S  1.791496 2.675573 0.720253
S  1.191437 -0.530099 0.91705
O  1.840279 3.70644 1.99472
O  1.143309 3.186409 -0.687606
O  1.248675 -0.595381 -0.718095
O  2.591828 -0.744108 1.760461
C  0.594084 1.241217 1.494541
C  -0.858496 1.636304 1.27298
C  -1.451018 1.472086 -0.164586
C  3.608948 1.960173 0.407353
C  -0.068685 -1.884305 1.585542
C  -2.216491 0.172205 -0.392947
C  3.787353 1.628035 -1.065955
C  0.338764 -3.21832 0.972483
C  -1.856096 -0.70943 -1.444732
C  -3.33483 -0.16555 0.417734
C  -2.587722 -1.897316 -1.676566
C  -4.06504 -1.354603 0.192495
C  -3.691443 -2.228011 -0.856751
H  0.935764 1.261942 2.542928
H  -0.910426 2.70257 1.578579
H  -1.482866 1.089519 2.008779
H  -0.648784 1.593203 -0.910532
H  -2.141953 2.322075 -0.321366
H  4.205108 2.810755 0.777665
H  3.65403 1.088533 1.084858
H  0.075052 -1.816857 2.675987
H  -1.059308 -1.527643 1.265394
H  4.842804 1.330012 -1.219581
H  3.142841 0.786653 -1.370125
H  3.57449 2.496371 -1.711315
H  -0.367623 -3.994739 1.321581
H  0.284755 -3.178649 -0.128437
H  1.357568 -3.513052 1.275906
H  -0.991529 -0.467208 -2.070458
H  -3.65291 0.516723 1.21737
H  -2.29453 -2.563338 -2.49598
H  -4.929264 -1.592664 0.823167
H  -4.259672 -3.147328 -1.037392
