program: Gaussian 09
title: 000240641
version: EM64L-G09RevD.01
frameworkgroup: C1[X(C12H16N2O2)]
method: RPBEPBE
basis: SDD
operation: Freq
keyword: #p
keyword: freq=noraman
keyword: PBEPBE/SDD
title: #p freq=noraman PBEPBE/SDD
converged: YES YES NO NO
title: Mulliken charges:
elementType: O O N N C C C C C C C C C C C C H H H H H H H H H H H H H H H H
charge: -0.265455 -0.282875 -0.635739 -0.068070 -0.522919 -0.548790 0.370601 0.372435 -0.539345 -0.352040 -0.033253 -0.347622 -0.294781 0.174491 -0.690122 -0.198002 0.264361 0.263796 0.245409 0.245615 0.279624 0.223430 0.208337 0.193366 0.199365 0.220046 0.221866 0.331194 0.323444 0.212482 0.213298 0.215853
chargesum: 0.00000
title: Mulliken charges with hydrogens summed into heavy atoms:
elementType: O O N N C C C C C C C C C C C C
charge: -0.265455 -0.282875 0.018899 -0.068070 0.005238 -0.057766 0.370601 0.372435 -0.259721 0.079727 -0.033253 0.045110 0.147131 0.174491 -0.048490 -0.198002
polarizability: 2.61930743e+02 2.36672590e+01 1.58996280e+02 -1.67160770e+01 5.94769494e+00 9.46254235e+01
1716.lowfreq: -16.0715 -6.5439 -0.0008 -0.0007 -0.0006 6.6640 18.9388 29.2096 55.8598
frequency: 15.0974 29.0621 55.7765 66.9215 79.9589 96.4503 110.4343 115.9656 129.0142 154.9090 187.4311 224.9701 239.1223 267.6467 272.6515 312.1281 398.5541 412.8747 428.3800 448.1737 476.7272 500.3255 505.4373 507.7583 555.6582 598.2822 618.6395 712.0633 726.4910 743.8146 781.5362 809.0059 818.3135 863.8856 871.3127 895.2614 904.6794 936.8398 968.5605 1001.5383 1004.9782 1033.0145 1051.9258 1073.8199 1084.3089 1115.3335 1150.0775 1163.8864 1197.8563 1219.1676 1225.5713 1244.2961 1269.4115 1273.0582 1286.9357 1288.0251 1291.0040 1344.5545 1350.9312 1368.2503 1387.8347 1413.5686 1437.0309 1449.9062 1457.5346 1470.8051 1475.1161 1477.5709 1489.2228 1563.4345 1587.8640 1618.3672 1658.8123 2159.2969 2967.1915 2974.8047 2987.6064 2992.7178 3012.0250 3016.7081 3033.4612 3034.8230 3051.7526 3072.8043 3074.3309 3080.4868 3097.2909 3177.7609 3543.1581 3680.3639
redmass: 3.7574 4.7542 2.1760 3.0164 3.4704 2.6285 3.5389 7.0701 3.6287 2.4571 3.6483 1.1446 4.8297 4.0955 6.8946 4.3639 3.0096 3.3462 1.3001 5.4582 3.1863 1.4302 9.3908 6.7584 1.5621 4.5069 5.1315 4.3794 7.5096 1.0887 3.4011 1.5178 1.4088 1.5107 5.2447 2.0826 2.5147 1.2076 4.1126 2.0343 2.9051 3.6983 1.4294 2.4075 5.2301 2.5228 1.1687 1.7567 1.1040 2.4150 1.3310 1.5776 1.4329 1.8052 1.0811 1.1436 2.0045 1.4665 4.9627 1.4338 1.2175 4.1589 1.1234 1.1077 1.0978 1.0673 1.0431 1.0633 1.0860 7.7368 6.6545 2.6644 1.6930 12.6303 1.0583 1.0365 1.0596 1.0594 1.1001 1.0582 1.0635 1.1018 1.1028 1.1011 1.0995 1.1002 1.1079 1.0967 1.0455 1.1037
irintensity: 2.1796 2.0829 1.2847 1.7956 0.1514 0.8549 0.8214 1.7722 3.3328 0.5853 0.0857 0.3493 1.2835 4.6600 6.7164 16.9444 5.3618 3.4126 14.2453 4.1121 13.5246 193.0070 3.9680 3.1534 59.7358 25.0670 25.1015 2.4825 3.2340 9.5344 4.6855 1.9891 2.4055 51.5252 6.1680 13.0387 0.2759 3.4072 113.5696 0.4189 57.4619 34.1542 41.0430 3.9196 320.5856 4.1800 0.0491 39.7038 0.2032 127.4385 5.2798 7.7111 29.7879 159.7302 1.4827 10.8542 217.5083 8.1480 11.3926 5.2852 9.8454 21.0209 8.9310 39.3650 17.6649 0.0623 12.4182 3.6506 18.9272 960.8127 105.1308 189.0315 389.6773 69.7004 34.4958 33.9467 45.0636 18.0438 9.6122 61.5536 2.7027 10.5122 5.1613 60.8199 57.3501 7.3721 39.9982 5.0790 169.6185 34.8265
temp: 298.150 k
press: 1.00000 atm
elementType: 8 8 7 7 6 6 6 6 6 6 6 6 6 6 6 6 1 1 1 1 1 1 1 1 1 1 1 1 1 1 1 1
symmnumber: 1
zpe: 683795.7 jmol-1
zpe.correction: 0.260444 hartree
zpe.thermalcorrener: 0.277752 hartree
zpe.thermalcorrenthalpy: 0.278696 hartree
zpe.thermalcorrgfe: 0.212984 hartree
zpe.sumelectzpe: -725.617348 hartree
zpe.sumelectthermal: -725.600040 hartree
zpe.sumelectthermalent: -725.599096 hartree
zpe.sumelectthermalfe: -725.664808 hartree
dipole: -6.0092 -4.8861 0.5594
dipole: 7.7652
quadrupole: -40.3885 -110.5642 -95.9450
quadrupole: 9.6898 -5.6673 -2.2710
quadrupole: 41.9107 -28.2649 -13.6457 9.6898 -5.6673 -2.2710
hfenergy: -725.8777916 hartree
pointgroup: C01 [X(C12H16N2O2)]
dipole: 2.3622673 -0.9788334 -1.6718115 debye
polarizability: 260.997911|1.8450759|125.7459221|-31.7195806|32.0055261|128.808614 unknown
InChI: InChI=1S/C12H16N2O2/c1-2-3-6-16-12(15)11(8-13)9-4-5-10(14)7-9/h7H,2-6,14H2,1H3
charge 0 multiplicity 1
32 atoms
O  -1.747165 -0.020614 1.591201
O  -0.839679 -1.497954 0.017341
N  5.326119 0.274408 -0.233759
N  0.614093 2.194482 2.798227
C  1.931464 -1.260729 -0.58274
C  3.43605 -1.217615 -0.980284
C  1.757078 -0.140238 0.440356
C  4.002055 -0.075001 -0.153399
C  3.020444 0.512825 0.640246
C  -3.853563 -0.002957 0.253125
C  0.557457 0.198566 1.084342
C  -5.282933 -0.580677 0.123918
C  -3.079176 -0.660586 1.404131
C  -0.695163 -0.530391 0.818757
C  -6.078809 0.072331 -1.026985
C  0.554034 1.281158 2.024587
H  1.631458 -2.231598 -0.153187
H  1.258314 -1.11018 -1.443831
H  3.573406 -1.029792 -2.062544
H  3.953013 -2.168592 -0.74834
H  3.170258 1.351306 1.324441
H  -3.301143 -0.16012 -0.692587
H  -3.905822 1.088849 0.429423
H  -5.82802 -0.435421 1.078994
H  -5.225012 -1.675632 -0.042109
H  -3.582865 -0.503577 2.372797
H  -2.934923 -1.740631 1.217747
H  5.701231 1.040551 0.322107
H  5.96403 -0.223679 -0.849578
H  -6.171052 1.164038 -0.874653
H  -5.574223 -0.089668 -1.997804
H  -7.098854 -0.347162 -1.100838
