program: Gaussian 09
title: 000240631
version: EM64L-G09RevD.01
frameworkgroup: C1[X(C11H17NO3)]
method: RPBEPBE
basis: SDD
operation: Freq
keyword: #p
keyword: freq=noraman
keyword: PBEPBE/SDD
title: #p freq=noraman PBEPBE/SDD
converged: YES YES NO NO
title: Mulliken charges:
elementType: O O O N C C C C C C C C C C C H H H H H H H H H H H H H H H H H
charge: -0.267323 -0.412316 -0.224722 -0.412608 0.382809 0.402908 -0.567981 -0.459698 -0.435021 -0.444891 -0.545142 -0.572462 -0.772885 0.089447 0.186577 0.202868 0.252224 0.193744 0.210175 0.211147 0.196494 0.239683 0.208700 0.243771 0.240780 0.328988 0.245504 0.246214 0.219920 0.217097 0.213496 0.382501
chargesum: 0.00000
title: Mulliken charges with hydrogens summed into heavy atoms:
elementType: O O O N C C C C C C C C C C C
charge: -0.267323 -0.029815 -0.224722 -0.083620 0.382809 0.402908 -0.112888 -0.055779 -0.027381 0.003492 -0.060591 -0.080744 -0.122372 0.089447 0.186577
polarizability: 1.34432041e+02 2.86473461e+00 1.27039568e+02 2.49532557e+00 -8.20641579e-01 1.19383025e+02
1716.lowfreq: -13.4571 -3.9649 -0.0010 -0.0009 -0.0007 9.5414 32.8937 56.7888 84.9146
frequency: 32.8606 56.7283 84.9005 93.0063 146.2160 208.3676 217.7914 239.9497 250.0983 274.3507 290.3798 346.2458 380.6097 392.4825 401.2866 425.7497 451.5055 485.5260 502.2056 505.1808 525.0484 556.0998 570.3564 638.5376 662.0326 714.8937 756.7698 798.3169 834.8319 843.6037 858.8746 876.6171 881.6859 910.5076 938.8108 954.5152 969.7089 978.5146 1020.1570 1036.5515 1047.6416 1057.1344 1084.9464 1104.7164 1139.5821 1156.3589 1166.0322 1196.4219 1204.4524 1222.7571 1271.5785 1286.2080 1294.1903 1295.2587 1312.3324 1313.1801 1326.3217 1331.5886 1346.6735 1350.8220 1356.4211 1388.6957 1414.4370 1435.4903 1443.4785 1453.2517 1459.7806 1469.1430 1474.2054 1476.0074 1481.5425 1617.0566 1658.4196 2960.6741 2966.4711 2969.5912 2986.3147 2991.0937 2993.1582 3019.8580 3023.1204 3030.6939 3047.5428 3051.3421 3054.2985 3062.9473 3064.3399 3094.1291 3490.4461 3504.6541
redmass: 7.2985 7.0264 5.1502 3.8907 3.1157 1.3465 2.1909 3.8335 1.9870 2.4732 3.0627 3.7939 1.9906 2.4896 2.2916 2.9479 3.3984 3.7311 2.4250 2.3179 3.5842 2.3714 3.9508 1.3274 1.5863 3.9786 2.2701 3.0365 4.3309 2.7754 1.5284 2.3718 2.6597 2.4326 1.9905 1.9152 1.7090 1.9903 2.1690 2.1485 1.7202 1.8442 1.9188 1.4439 3.1381 1.6266 1.5081 1.9484 1.3911 1.5690 1.7184 1.5148 1.5918 1.6561 1.5014 1.6497 1.5851 1.7992 2.1814 1.8653 1.7142 1.2109 1.5870 1.1167 1.1046 1.0866 1.1256 1.0916 1.0661 1.0574 1.0848 5.5705 8.3464 1.0597 1.0373 1.0600 1.0622 1.0618 1.0642 1.0599 1.0983 1.0993 1.0993 1.1006 1.1018 1.0988 1.0991 1.1027 1.0762 1.0638
irintensity: 1.4760 0.3813 2.5349 0.0884 0.4370 0.1707 0.8754 1.0247 0.1295 0.5925 1.4450 4.6686 2.5508 0.4141 2.4762 4.3808 10.6496 3.8123 21.8038 7.2160 8.3657 7.0623 29.6914 129.7037 128.5603 13.1503 5.8836 5.8328 13.9990 1.4382 6.7313 4.7061 0.2413 0.0238 11.2815 8.9801 5.4513 4.0913 22.2366 3.1283 0.9515 109.5372 2.8593 31.4884 8.2309 8.8229 68.0137 1.5334 0.8584 3.5293 13.1199 4.0778 10.8772 22.3133 25.2741 2.9263 18.7964 33.4867 99.8886 27.5913 41.3488 13.3277 30.8994 1.3755 1.7546 5.3652 10.5816 4.9816 20.7441 14.0959 7.8885 361.2449 221.2851 26.9978 48.1446 32.5113 22.4065 31.6496 10.6105 12.2003 30.1352 34.6189 11.0493 27.9884 21.0265 43.6111 59.4191 9.4039 22.5640 25.0490
temp: 298.150 k
press: 1.00000 atm
elementType: 8 8 8 7 6 6 6 6 6 6 6 6 6 6 6 1 1 1 1 1 1 1 1 1 1 1 1 1 1 1 1 1
symmnumber: 1
zpe: 706147.7 jmol-1
zpe.correction: 0.268957 hartree
zpe.thermalcorrener: 0.283266 hartree
zpe.thermalcorrenthalpy: 0.284210 hartree
zpe.thermalcorrgfe: 0.228010 hartree
zpe.sumelectzpe: -708.665977 hartree
zpe.sumelectthermal: -708.651668 hartree
zpe.sumelectthermalent: -708.650724 hartree
zpe.sumelectthermalfe: -708.706924 hartree
dipole: -0.7241 -5.7063 0.5529
dipole: 5.7786
quadrupole: -89.1368 -108.3435 -82.2692
quadrupole: -2.1289 -2.7001 0.7181
quadrupole: 4.1130 -15.0937 10.9806 -2.1289 -2.7001 0.7181
hfenergy: -708.934934 hartree
pointgroup: C01 [X(C11H17N1O3)]
dipole: 0.0257338 2.2729375 0.041755 debye
polarizability: 133.271315|3.4156195|127.8283087|-3.7018395|-0.3340834|119.7550104 unknown
InChI: InChI=1S/C11H17NO3/c1-10-3-2-4-11(7-10,6-9(14)15)12-8(13)5-10/h12,14H,2-7H2,1H3
charge 0 multiplicity 1
32 atoms
O  0.842579 -2.985562 -0.151397
O  -3.163686 0.740194 -1.119658
O  -3.426175 -1.115613 0.249712
N  -0.28564 -1.08089 0.53094
C  1.548997 0.691572 -0.865095
C  -0.438965 0.38767 0.690515
C  0.06782 1.073444 -0.601025
C  2.409766 1.161061 0.346977
C  0.404334 0.88762 1.907741
C  1.910266 0.612026 1.703287
C  1.627388 -0.851304 -1.056718
C  -1.944148 0.712904 0.974759
C  2.056946 1.390414 -2.148174
C  0.719204 -1.722752 -0.178835
C  -2.905613 0.003608 0.045104
H  -0.020302 2.171087 -0.483814
H  -0.5672 0.780811 -1.457539
H  2.389958 2.270804 0.374211
H  3.464996 0.864849 0.185672
H  0.047598 0.389064 2.830094
H  0.232019 1.97634 2.033549
H  2.094485 -0.477474 1.762956
H  2.486265 1.070125 2.529687
H  2.661254 -1.217483 -0.916347
H  1.356116 -1.109211 -2.100257
H  -0.912772 -1.699668 1.057502
H  -2.192192 0.388735 2.001668
H  -2.082773 1.804155 0.903181
H  3.097376 1.090797 -2.376933
H  1.430086 1.128681 -3.021424
H  2.040422 2.491086 -2.035849
H  -3.783214 0.221706 -1.703186
