program: Gaussian 09
title: 000240630
version: EM64L-G09RevD.01
frameworkgroup: C1[X(C11H16O3)]
method: RPBEPBE
basis: SDD
operation: Freq
keyword: #pfreq=noraman
keyword: PBEPBE/SDD
title: #p freq=noraman PBEPBE/SDD
converged: YES YES NO NO
title: Mulliken charges:
elementType: O O O C C C C C C C C C C C H H H H H H H H H H H H H H H H
charge: -0.277823 -0.290398 -0.451650 -0.143862 0.513307 -0.715460 -0.500203 -0.463589 0.230756 -0.212342 -0.351368 0.164860 -0.682308 -0.522246 0.185240 0.234144 0.214306 0.230929 0.283997 0.233705 0.209666 0.181233 0.212680 0.201213 0.224520 0.229271 0.358692 0.263038 0.210308 0.229384
chargesum: 0.00000
title: Mulliken charges with hydrogens summed into heavy atoms:
elementType: O O O C C C C C C C C C C C
charge: -0.277823 -0.290398 -0.092959 0.041378 0.513307 -0.036082 -0.216206 -0.229883 0.230756 0.178557 -0.138688 0.164860 -0.027304 0.180485
polarizability: 1.65265720e+02 7.78276702e+00 1.29669170e+02 -8.28138078e+00 1.25389695e+01 1.01979344e+02
1716.lowfreq: -7.4632 -4.7115 0.0002 0.0004 0.0006 7.6830 25.2582 46.8458 59.5867
frequency: 25.2026 46.8431 59.5738 74.3852 116.8913 133.4876 153.0470 167.1828 190.5972 222.6565 234.0195 247.6599 275.0057 298.0516 329.0788 331.7631 369.8997 416.5375 453.5814 470.3190 486.5570 547.9589 589.7560 648.5536 693.1077 728.3292 747.0814 792.9530 803.7825 816.8536 869.8850 905.1904 922.0591 932.2312 978.4927 1019.2825 1052.1618 1072.3279 1078.7751 1092.3598 1112.5581 1130.8997 1138.6148 1154.1360 1159.5372 1169.7758 1221.8843 1250.6814 1257.0854 1266.1936 1295.2993 1326.0450 1370.3920 1385.3568 1392.2733 1393.7552 1414.3546 1440.9832 1456.7106 1458.6091 1459.2914 1472.1714 1479.4488 1481.5674 1493.4291 1498.5613 1596.0657 1613.8022 2914.4136 2927.3965 2975.0330 2988.5363 2991.9177 2992.3536 3084.4543 3089.4601 3095.1059 3097.7467 3098.8772 3103.7747 3127.9266 3136.2067 3155.7764 3579.6243
redmass: 3.7473 3.1686 2.1446 2.1425 3.6349 1.6253 3.7184 2.3214 2.2092 1.0996 1.6390 2.1137 4.9248 3.9446 3.9033 1.1684 4.4883 4.1254 3.6700 3.5593 3.7884 5.1950 4.2338 4.0972 5.0736 3.6702 4.3824 1.4657 2.3064 1.1031 4.5934 1.4409 1.4493 2.2967 3.3674 2.1413 3.2898 2.1427 2.3470 2.1875 1.2405 2.2718 1.4529 1.3552 1.1873 2.1074 1.9680 1.1881 1.9754 1.8651 1.2233 1.6979 1.3305 1.2603 2.4443 1.8116 1.9114 1.4543 1.0662 1.0416 1.0535 1.0617 1.0473 1.0559 1.1013 2.7976 6.5994 6.9126 1.0826 1.0609 1.0351 1.1004 1.0358 1.0354 1.0967 1.0990 1.0999 1.1007 1.1009 1.0878 1.1047 1.0953 1.0914 1.0660
irintensity: 0.4542 1.2998 6.0229 0.7775 3.7541 2.0537 2.6798 3.8622 1.6122 0.0998 0.9968 3.4138 4.9579 5.9631 15.9136 117.7574 4.2930 3.4576 9.2670 11.2167 5.2755 17.1602 5.1899 12.3923 6.9371 2.1568 12.1092 40.1151 4.6454 2.9191 16.2768 11.3641 2.5346 46.5887 44.4752 15.6610 80.3543 92.1829 108.2467 32.3919 5.2904 5.1546 3.9707 26.1416 40.0207 28.1104 55.9721 2.7546 33.3626 221.9112 14.9157 20.4032 3.8515 21.4888 15.1324 13.8338 20.4374 13.1356 14.0434 8.9106 6.0355 11.9575 7.4021 26.8666 3.3454 92.3138 27.8035 7.3779 37.2546 77.9933 86.8351 44.4295 36.2208 13.3241 36.5786 34.6590 25.8238 22.7122 53.4721 19.3472 15.9290 16.6482 0.4399 35.2350
temp: 298.150 k
press: 1.00000 atm
elementType: 8 8 8 6 6 6 6 6 6 6 6 6 6 6 1 1 1 1 1 1 1 1 1 1 1 1 1 1 1 1
symmnumber: 1
zpe: 649820.9 jmol-1
zpe.correction: 0.247504 hartree
zpe.thermalcorrener: 0.263140 hartree
zpe.thermalcorrenthalpy: 0.264084 hartree
zpe.thermalcorrgfe: 0.203863 hartree
zpe.sumelectzpe: -653.321081 hartree
zpe.sumelectthermal: -653.305444 hartree
zpe.sumelectthermalent: -653.304500 hartree
zpe.sumelectthermalfe: -653.364721 hartree
dipole: 1.6553 -2.8430 -1.1362
dipole: 3.4805
quadrupole: -75.5135 -80.0893 -81.1540
quadrupole: -2.8064 2.3012 4.6899
quadrupole: 3.4055 -1.1704 -2.2350 -2.8064 2.3012 4.6899
hfenergy: -653.5685842 hartree
pointgroup: C01 [X(C11H16O3)]
dipole: -0.6843466 -1.083161 0.4832211 debye
polarizability: 163.5869311|-10.0171187|130.3390996|-11.4026808|-11.8981692|102.9882033 unknown
InChI: InChI=1S/C11H16O3/c1-4-14-8(2)9-5-6-10(12)11(7-9)13-3/h5-8,12H,4H2,1-3H3
charge 0 multiplicity 1
30 atoms
O  2.869387 0.341828 -0.326389
O  -1.987334 1.989526 -0.180401
O  -3.401537 -0.05819 1.282381
C  2.039327 -0.864245 -0.509693
C  0.606814 -0.664435 -0.013224
C  2.101883 -1.172068 -2.015244
C  -0.090829 0.53013 -0.312791
C  -0.059903 -1.678304 0.712128
C  -1.4257 0.731981 0.096287
C  3.113398 0.681025 1.086721
C  -1.397889 -1.496433 1.126107
C  -2.083214 -0.296068 0.836175
C  4.046965 1.891407 1.106907
C  -3.346449 2.032378 -0.759733
H  2.495675 -1.70833 0.058513
H  1.683332 -0.328709 -2.591622
H  1.518591 -2.079615 -2.250773
H  3.149421 -1.323906 -2.327736
H  0.408086 1.338616 -0.857425
H  0.461132 -2.610969 0.958731
H  2.153047 0.908869 1.594973
H  3.577184 -0.190466 1.601791
H  -1.90778 -2.283679 1.698489
H  4.267124 2.192325 2.147634
H  4.998389 1.656837 0.598823
H  3.579815 2.745996 0.5874
H  -3.720585 -0.820713 1.825982
H  -4.089433 1.610294 -0.064404
H  -3.372179 1.482152 -1.720481
H  -3.540937 3.101067 -0.937229
