program: Gaussian 09
title: 000240687
version: EM64L-G09RevD.01
frameworkgroup: C1[X(C30H24N2O2)]
method: RPBEPBE
basis: SDD
operation: Freq
keyword: #p
keyword: freq=noraman
keyword: PBEPBE/SDD
title: #p freq=noraman PBEPBE/SDD
converged: YES YES NO NO
title: Mulliken charges:
elementType: O O N N C C C C C C C C C C C C C C C C C C C C C C C C C C C C C C H H H H H H H H H H H H H H H H H H H H H H H H
charge: -0.236787 -0.283437 -0.080759 -0.041346 -0.526802 -0.449804 0.026921 0.040882 0.326886 0.297931 0.304704 0.297252 0.090550 0.042480 -0.377597 -0.369610 -0.379178 -0.381085 -0.340814 -0.367943 -0.358889 -0.371535 -0.236118 -0.235095 -0.233405 -0.238111 -0.248724 -0.229943 -0.255906 -0.238118 -0.236498 -0.233950 -0.231316 -0.235219 0.258355 0.252082 0.226568 0.248009 0.260712 0.263901 0.267079 0.325045 0.271023 0.266927 0.289413 0.258386 0.228901 0.231180 0.231877 0.236631 0.251367 0.230946 0.235656 0.228661 0.231598 0.232316 0.233680 0.230072
chargesum: 0.00000
title: Mulliken charges with hydrogens summed into heavy atoms:
elementType: O O N N C C C C C C C C C C C C C C C C C C C C C C C C C C C C C C
charge: -0.236787 -0.283437 -0.080759 -0.041346 -0.016366 0.024773 0.026921 0.040882 0.326886 0.297931 0.304704 0.297252 0.090550 0.042480 -0.116885 -0.105709 -0.112099 -0.056040 -0.069791 -0.101016 -0.069475 -0.113149 -0.007217 -0.003915 -0.001528 -0.001480 0.002643 0.001002 -0.020249 -0.009457 -0.004899 -0.001634 0.002364 -0.005147
polarizability: 4.76932386e+02 5.47268050e+00 3.28302319e+02 -2.15570382e+01 -4.10322863e+00 2.66511271e+02
1716.lowfreq: -8.7888 -3.2244 -2.3683 -0.0007 -0.0003 0.0007 8.9496 15.1515 17.2018
frequency: 8.7423 15.0024 17.1053 35.8159 37.5704 49.4723 55.5227 61.4547 66.7021 71.9563 73.1732 84.3238 90.4081 92.0894 104.9386 132.3528 149.9800 196.5291 213.6418 219.9708 223.2818 225.7595 263.0685 278.9066 286.5675 303.3143 311.0279 379.5430 390.6834 401.7958 404.3206 410.2301 413.5520 428.9146 440.3533 460.8856 473.9470 526.4340 528.6917 560.5260 578.6555 611.7892 612.3294 614.3221 614.8504 623.4905 629.1009 637.4429 663.7495 670.1795 679.4066 698.0341 701.4360 704.4692 707.7055 708.0388 713.6681 765.4896 772.2838 794.3096 795.3644 816.9812 829.1236 858.0616 862.7045 864.3346 870.8462 910.1626 914.2823 936.8619 943.0672 944.8732 945.7429 953.9477 982.5572 985.6097 987.4632 987.8459 988.6319 989.7215 989.9281 990.9917 995.6796 1003.4966 1004.8969 1006.6745 1016.8874 1018.1892 1024.2232 1028.0061 1029.6099 1030.5685 1080.3741 1086.7053 1088.8425 1090.0383 1103.2585 1133.0378 1163.1879 1173.3456 1173.9496 1174.6371 1175.9497 1189.3574 1191.2444 1193.8001 1196.4426 1199.8622 1215.7906 1237.6663 1291.2915 1292.4795 1318.8229 1321.0175 1322.3419 1327.3719 1332.3241 1334.9848 1378.1853 1379.0551 1384.6472 1385.1439 1431.3789 1432.5440 1434.3153 1436.8916 1437.9920 1440.5530 1476.2788 1479.2558 1482.9590 1485.7871 1524.4178 1552.7104 1581.7788 1582.5687 1584.9670 1586.2608 1604.5360 1607.0670 1607.7322 1607.8176 1637.4373 1705.1223 2994.8369 3017.5462 3057.3636 3091.5847 3125.5110 3127.9357 3128.3063 3128.3992 3132.6179 3136.5701 3138.0774 3141.1071 3141.6465 3146.4491 3149.7834 3150.6654 3153.6406 3156.2602 3158.1384 3159.4215 3165.8020 3168.1353 3169.3671 3171.8253
redmass: 6.2775 5.6886 5.9462 5.7319 5.3910 4.2689 4.6890 5.7729 4.9512 4.7396 5.0337 4.6632 6.8322 4.9302 6.7937 5.8428 5.1608 3.9354 3.8488 4.8944 4.4729 5.3888 5.1597 5.8426 4.4167 5.0195 4.5820 4.4449 5.1227 2.8348 2.8493 2.8916 2.9258 4.0947 4.2009 3.9220 4.1657 3.1550 4.3148 5.5031 5.2697 6.3883 6.4135 6.3853 6.2665 6.6316 4.2889 6.4578 4.5666 4.6417 5.3169 4.6124 1.7833 2.1493 1.6542 1.9764 2.6421 1.7016 1.7895 2.4286 2.3516 4.5709 4.0994 1.2458 1.2415 1.2420 1.2386 5.1218 3.9699 2.3508 1.4817 1.5073 1.7118 1.4280 2.0153 1.5681 5.1096 5.9111 3.1213 1.6433 3.2453 1.6657 1.3555 1.3246 1.3226 1.3447 2.6587 1.5047 2.3632 2.1925 2.1643 2.0507 1.8434 1.6390 1.6294 1.6228 2.0080 3.2563 1.4449 1.0565 1.0577 1.0573 1.0567 1.1170 1.4615 1.1441 1.1221 1.1320 2.9612 2.5634 3.0973 3.1939 1.4698 1.4818 1.3537 1.4659 1.3694 1.6613 6.5833 7.5997 8.4991 9.1966 1.4644 1.5527 2.2421 2.1946 2.0356 1.1973 2.1929 2.1625 2.3837 2.3128 7.8732 7.6963 5.7000 5.7864 5.9859 6.1865 6.3004 6.0796 5.7950 5.8754 11.2470 12.5091 1.0616 1.0603 1.0988 1.1025 1.0853 1.0851 1.0853 1.0852 1.0899 1.0886 1.0883 1.0888 1.0924 1.0931 1.0921 1.0918 1.0961 1.0964 1.0968 1.0960 1.1014 1.1016 1.1012 1.1010
irintensity: 0.5469 0.1639 0.7624 0.4324 0.3425 0.6791 1.6150 0.5981 1.8315 1.0152 1.1613 1.6067 7.7031 3.5649 2.8136 0.6799 3.0075 2.9779 1.2195 1.9509 1.3174 4.1512 2.1546 1.4127 8.4259 0.7938 5.3998 6.5597 22.8787 0.2816 0.4262 0.1240 0.0406 2.1629 3.0706 6.1185 10.7937 4.7897 1.6942 3.5090 28.9444 1.0774 0.3934 2.5754 0.7150 28.4671 18.2317 23.1708 20.4979 16.5524 5.3116 1.5539 55.7947 60.7182 95.4332 12.4554 44.3698 39.9733 33.2709 36.8198 33.7588 19.4929 24.7900 2.8845 4.6191 3.1721 2.3413 37.5906 38.1220 12.1149 4.1804 1.3819 14.7855 2.0432 3.7087 2.2555 5.4320 1.0069 0.9640 4.8633 2.3488 1.5808 1.5791 0.2492 0.6841 0.4980 13.6297 5.7338 1.7349 4.1103 9.0033 6.4620 54.6624 3.8842 8.1151 2.9855 168.5629 77.0381 7.1470 0.8394 0.3085 0.2357 0.2833 18.3428 5.7262 3.0078 11.5765 2.9655 145.4629 41.9370 142.1351 125.2850 48.6067 17.0403 2.9168 28.2211 11.5488 23.8832 0.9367 2.2208 1.1044 3.5280 54.0871 17.6156 26.5919 9.0727 25.6213 33.5456 3.4579 2.6804 0.1273 0.7553 105.3812 186.1120 2.5660 0.3865 4.0886 46.0666 63.7002 31.2933 14.5323 13.1127 412.7862 469.9612 20.9297 17.0237 9.9612 10.3599 2.0301 0.6101 0.7843 0.1257 25.0506 7.0123 4.6638 9.1290 11.6155 8.7083 39.3454 0.4649 22.5088 12.3418 12.1678 23.5937 37.3207 30.6237 24.8209 11.3901
temp: 298.150 k
press: 1.00000 atm
elementType: 8 8 7 7 6 6 6 6 6 6 6 6 6 6 6 6 6 6 6 6 6 6 6 6 6 6 6 6 6 6 6 6 6 6 1 1 1 1 1 1 1 1 1 1 1 1 1 1 1 1 1 1 1 1 1 1 1 1
symmnumber: 1
zpe: 1191858.4 jmol-1
zpe.correction: 0.453955 hartree
zpe.thermalcorrener: 0.483316 hartree
zpe.thermalcorrenthalpy: 0.484261 hartree
zpe.thermalcorrgfe: 0.388730 hartree
zpe.sumelectzpe: -1415.203639 hartree
zpe.sumelectthermal: -1415.174277 hartree
zpe.sumelectthermalent: -1415.173333 hartree
zpe.sumelectthermalfe: -1415.268863 hartree
dipole: -0.6936 1.6033 -0.0155
dipole: 1.7470
quadrupole: -145.8621 -183.2442 -195.7582
quadrupole: 3.8512 1.0575 6.5264
quadrupole: 29.0928 -8.2894 -20.8034 3.8512 1.0575 6.5264
hfenergy: -1415.6575935 hartree
pointgroup: C01 [X(C30H24N2O2)]
dipole: -0.3413624 -0.4655174 0.373044 debye
polarizability: 475.8043867|-18.8679039|305.6353797|12.9340233|-32.9475911|290.3062091 unknown
InChI: InChI=1S/C30H24N2O2/c33-27(31-29(23-13-5-1-6-14-23)24-15-7-2-8-16-24)21-22-28(34)32-30(25-17-9-3-10-18-25)26-19-11-4-12-20-26/h1-20H,21-22H2
charge 0 multiplicity 1
58 atoms
O  0.935112 1.167211 1.452721
O  -0.931906 0.961614 -2.39098
N  2.862788 0.968347 0.151094
N  -1.817613 0.634643 -0.259396
C  1.083539 2.466112 -0.639673
C  -0.454762 2.623138 -0.639456
C  3.375117 -0.216414 -0.069275
C  -2.990302 0.401616 0.251279
C  2.532419 -1.409225 -0.414581
C  4.861885 -0.356833 0.020301
C  -4.229585 1.026413 -0.319915
C  -3.058529 -0.496059 1.445556
C  1.575144 1.435909 0.389466
C  -1.14056 1.361886 -1.195091
C  2.834252 -2.688933 0.12789
C  5.563654 -1.336376 -0.733482
C  -5.281481 1.480023 0.521732
C  -1.909249 -0.616483 2.27666
C  1.392551 -1.26646 -1.248635
C  5.597625 0.534281 0.848241
C  -4.3359 1.213616 -1.726535
C  -4.221624 -1.255462 1.746338
C  2.002896 -3.794866 -0.14941
C  6.970828 -1.422518 -0.656978
C  -6.414131 2.114335 -0.032352
C  -1.934415 -1.47466 3.393906
C  0.570879 -2.375048 -1.535417
C  7.000334 0.438799 0.933004
C  -5.477084 1.833383 -2.276224
C  -4.236401 -2.120575 2.861867
C  0.870924 -3.642603 -0.984344
C  7.692902 -0.540485 0.179494
C  -6.518166 2.288003 -1.432284
C  -3.095765 -2.22879 3.691084
H  1.444287 2.193112 -1.647932
H  1.553454 3.437352 -0.388189
H  -0.72701 3.464121 -1.303775
H  -0.807357 2.836836 0.38303
H  3.700259 -2.808355 0.787577
H  5.0111 -2.013273 -1.393232
H  -5.198607 1.358658 1.606935
H  -1.012052 -0.034219 2.034662
H  1.143007 -0.299472 -1.697198
H  5.047685 1.292792 1.414754
H  -3.531227 0.860415 -2.381077
H  -5.100532 -1.189596 1.096245
H  2.234459 -4.771609 0.289629
H  7.502664 -2.173605 -1.251206
H  -7.212122 2.474382 0.62623
H  -1.048433 -1.555625 4.03285
H  -0.302109 -2.236489 -2.181101
H  7.556085 1.123698 1.582802
H  -5.554342 1.960805 -3.361349
H  -5.132522 -2.711752 3.080748
H  0.226904 -4.502637 -1.199368
H  8.784527 -0.612424 0.242616
H  -7.401714 2.773515 -1.861473
H  -3.110476 -2.896367 4.560211
