program: Gaussian 09
title: 000240625
version: EM64L-G09RevD.01
frameworkgroup: C1[X(C10H12O4S2)]
method: RPBEPBE
basis: SDD
operation: Freq
keyword: #p
keyword: freq=noraman
keyword: PBEPBE/SDD
title: #p freq=noraman PBEPBE/SDD
converged: NO YES NO NO
title: Mulliken charges:
elementType: S S O O O O C C C C C C C C C C H H H H H H H H H H H H
charge: 0.941298 0.950682 -0.539480 -0.510263 -0.529305 -0.525675 -0.424592 -0.557400 -0.566848 0.562374 -0.727684 -0.379773 -0.260154 -0.225437 -0.250751 -0.222236 0.320641 0.300248 0.317458 0.307074 0.283784 0.293321 0.251580 0.243748 0.234680 0.236778 0.237298 0.238633
chargesum: 0.00000
title: Mulliken charges with hydrogens summed into heavy atoms:
elementType: S S O O O O C C C C C C C C C C
charge: 0.941298 0.950682 -0.539480 -0.510263 -0.529305 -0.525675 -0.424592 0.063489 0.057683 0.562374 0.101002 -0.136025 -0.025474 0.011341 -0.013453 0.016397
polarizability: 2.32549009e+02 -3.08034505e+00 1.47197142e+02 -4.77659670e-02 9.04672970e+00 1.59107235e+02
1716.lowfreq: -12.6541 -10.5458 -0.0029 -0.0028 -0.0026 7.9500 29.3288 41.6418 78.0681
frequency: 27.9633 41.5462 78.0567 111.0384 118.4294 138.9811 166.5617 183.3637 191.4664 205.4291 224.8786 227.0528 242.1041 274.6823 283.2401 314.9012 324.5819 334.9165 365.3342 394.7897 398.6425 429.4041 470.1434 509.1420 544.1288 552.9706 578.6489 613.2813 683.6591 767.3748 773.1849 791.1527 806.5680 830.4501 839.0413 894.2654 919.0898 927.0246 958.6647 972.0368 986.7321 999.9657 1020.6831 1029.7802 1034.8539 1055.6663 1061.0425 1070.3888 1113.2363 1126.5650 1180.1783 1206.0880 1225.5944 1261.2235 1299.7935 1327.2401 1382.4757 1394.7150 1397.6860 1405.5205 1432.1107 1441.0091 1466.7825 1482.5208 1577.3436 1603.9735 2975.0066 3052.3228 3057.4615 3063.5249 3086.4560 3136.3738 3145.2829 3148.3078 3156.2296 3160.7823 3171.2377 3185.0197
redmass: 6.8681 4.7775 5.1254 5.4491 3.9802 1.8754 5.3202 4.4991 6.2996 4.8954 4.7833 3.6960 3.2569 5.3330 6.5617 3.3625 3.9739 9.3876 4.3009 11.3594 2.9680 5.1713 4.8085 6.8780 3.2965 3.4038 5.2784 6.4308 1.6447 2.6180 2.8866 6.8727 13.0227 1.2748 1.7899 2.6289 1.4150 8.4260 3.1193 1.4116 5.7762 1.3382 2.7831 1.5255 1.7349 2.2529 1.3621 1.4570 1.6603 1.5966 1.0545 1.1219 1.2545 1.2115 3.9097 1.4264 5.6482 1.0934 1.1797 1.1227 1.8338 1.2058 1.1627 1.8168 5.4034 5.8922 1.0362 1.0539 1.0589 1.0974 1.0986 1.0856 1.1112 1.0890 1.1106 1.0934 1.0977 1.0975
irintensity: 8.9359 0.9391 0.7753 5.8957 1.4392 4.7525 1.7628 12.6173 0.5648 2.0761 10.3284 0.5314 4.2927 5.0592 3.8079 5.2499 12.5453 31.7516 7.5346 15.1273 0.5432 13.6707 6.9282 51.7766 1.8190 14.7386 2.8946 0.9164 40.9380 7.5399 10.3475 101.3607 4.9063 11.2665 74.9705 5.2551 2.4453 117.5303 14.7168 1.5415 3.4442 0.1809 4.7229 12.8163 1.5536 26.8089 3.7826 10.3339 7.9643 5.1071 0.2503 5.2623 4.0873 1.3416 74.7464 3.0860 0.4776 12.7902 44.2212 8.2866 16.6246 26.2046 14.9386 2.2046 1.0596 20.5907 4.9858 0.2816 0.6345 2.6928 1.0647 0.3114 0.8951 3.8426 1.5496 21.2311 25.9739 2.2896
temp: 298.150 k
press: 1.00000 atm
elementType: 16 16 8 8 8 8 6 6 6 6 6 6 6 6 6 6 1 1 1 1 1 1 1 1 1 1 1 1
symmnumber: 1
zpe: 528925.1 jmol-1
zpe.correction: 0.201457 hartree
zpe.thermalcorrener: 0.218514 hartree
zpe.thermalcorrenthalpy: 0.219458 hartree
zpe.thermalcorrgfe: 0.156815 hartree
zpe.sumelectzpe: -1483.759974 hartree
zpe.sumelectthermal: -1483.742917 hartree
zpe.sumelectthermalent: -1483.741973 hartree
zpe.sumelectthermalfe: -1483.804616 hartree
dipole: 0.6248 0.0763 -0.7158
dipole: 0.9532
quadrupole: -89.3007 -140.1479 -103.6745
quadrupole: -1.4437 11.2692 5.5413
quadrupole: 21.7403 -29.1069 7.3666 -1.4437 11.2692 5.5413
hfenergy: -1483.9614311 hartree
pointgroup: C01 [X(C10H12O4S2)]
dipole: -0.2560315 0.0725863 0.2642269 debye
polarizability: 232.5643955|0.859421|145.0067664|2.5825558|-7.2072225|161.2822245 unknown
InChI: InChI=1S/C10H12O4S2/c1-10(9-5-3-2-4-6-9)15(11,12)7-8-16(10,13)14/h2-6H,7-8H2,1H3
charge 0 multiplicity 1
28 atoms
S  1.398722 -1.600792 0.222574
S  1.32645 1.573132 0.146152
O  2.518575 -2.116682 -0.860693
O  0.433142 -2.64884 1.010606
O  0.493318 2.058286 1.466521
O  1.769928 2.624918 -1.021023
C  0.338075 -0.069266 -0.746813
C  2.445293 -0.581219 1.537116
C  2.925276 0.671925 0.843951
C  -1.080183 -0.05564 -0.353522
C  0.80167 -0.073765 -2.179066
C  -2.081203 0.120338 -1.356811
C  -1.487837 -0.167559 1.007916
C  -3.443223 0.172569 -1.006605
C  -2.852034 -0.1185 1.34996
C  -3.83427 0.050294 0.34776
H  3.253669 -1.286104 1.787688
H  1.772787 -0.399939 2.388924
H  3.351836 1.421961 1.528034
H  3.57037 0.491753 -0.029263
H  0.786202 0.953609 -2.590033
H  1.83203 -0.465736 -2.264434
H  0.160864 -0.730295 -2.792928
H  -1.792033 0.227214 -2.406625
H  -0.746511 -0.295292 1.799868
H  -4.199126 0.309501 -1.787006
H  -3.149434 -0.210083 2.399352
H  -4.894854 0.089215 0.618898
