program: Gaussian 09
title: 000020296
version: EM64L-G09RevD.01
frameworkgroup: C1[X(C8H14O3)]
method: RPBEPBE
basis: SDD
operation: Freq
keyword: #pfreq=noraman
keyword: PBEPBE/SDD
title: #p freq=noraman PBEPBE/SDD
converged: YES YES NO NO
title: Mulliken charges:
elementType: O O O C C C C C C C C H H H H H H H H H H H H H H
charge: -0.258998 -0.210695 -0.247961 -0.369100 -0.380025 -0.480442 -0.279011 0.217265 -0.765942 0.286570 -0.751712 0.219858 0.219385 0.207452 0.207366 0.230735 0.230195 0.229974 0.229966 0.233808 0.257804 0.234390 0.246732 0.246752 0.245634
chargesum: 0.00000
title: Mulliken charges with hydrogens summed into heavy atoms:
elementType: O O O C C C C C C C C
charge: -0.258998 -0.210695 -0.247961 0.070143 0.034794 -0.019512 0.180929 0.217265 -0.039940 0.286570 -0.012594
polarizability: 1.24803033e+02 -1.41403007e+00 9.44544154e+01 4.66550017e-02 -1.07766070e-02 6.82154810e+01
1716.lowfreq: -61.3556 -34.6693 -3.0863 -0.0010 -0.0006 0.0006 2.9982 16.2669 29.1852
frequency: -61.1501 -34.2823 28.3266 33.5685 56.6796 70.6062 97.9504 123.1050 146.5790 188.5260 202.8991 269.8597 379.3760 405.2607 459.9425 467.1969 566.1828 581.1043 613.4448 720.3021 771.7399 820.5736 832.3666 869.6440 932.6733 940.3742 971.8045 1002.6580 1041.2388 1054.1718 1062.3026 1104.0165 1114.8826 1160.4535 1171.2995 1206.1973 1236.5519 1250.4170 1279.3746 1288.5640 1316.3716 1361.2373 1367.9471 1374.2254 1383.4130 1431.3563 1443.6918 1453.5161 1454.6443 1454.7736 1467.2798 1473.3762 1487.2241 1636.4070 1650.2713 2957.9852 2981.8915 2986.2625 2998.1729 3000.4320 3004.7177 3007.9501 3032.2454 3057.7351 3064.3606 3078.3735 3095.3125 3124.3243 3144.6290
redmass: 1.1647 1.0708 4.8657 4.1755 4.5827 2.2261 2.0422 1.9329 4.7246 2.7998 6.8544 3.5243 3.5872 3.3920 2.0099 3.2708 2.9916 4.2063 4.9443 1.1410 1.1792 3.8446 5.5155 1.2711 2.3876 3.5366 1.2628 2.1689 1.6690 3.2653 2.9683 2.8717 1.8785 1.2588 2.0560 3.5890 1.2752 1.4349 1.1064 1.0936 1.5325 1.6137 1.2586 1.4580 1.3488 1.0809 1.0851 1.0634 1.0499 1.0471 1.0759 1.0870 1.0910 7.5238 9.2141 1.0600 1.0378 1.0601 1.0594 1.0969 1.0571 1.0371 1.1012 1.1046 1.0966 1.1073 1.0973 1.0997 1.1008
irintensity: 0.6214 0.4276 0.0018 0.7918 0.2575 0.0296 1.4390 0.3696 10.9343 7.4465 0.9428 2.6220 15.0638 4.3366 0.3482 1.4476 2.6779 4.3894 6.1091 8.7895 0.4890 1.2629 22.4386 0.2987 0.6123 34.4016 3.0950 108.6748 9.4669 14.9499 16.6542 3.3011 2.4796 0.7469 52.5498 365.3954 0.0211 65.6840 0.5942 0.1334 20.5757 11.6893 65.2359 18.2646 37.7770 9.4659 35.3934 28.4560 21.3110 18.8246 0.0037 2.9348 18.4267 84.9130 215.3462 15.6575 6.8229 7.1758 7.9290 6.8491 44.7407 6.4482 0.0491 5.4829 15.3962 82.4407 9.5296 14.4789 11.0500
temp: 298.150 k
press: 1.00000 atm
elementType: 8 8 8 6 6 6 6 6 6 6 6 1 1 1 1 1 1 1 1 1 1 1 1 1 1
symmnumber: 1
zpe: 543178.4 jmol-1
zpe.correction: 0.206886 hartree
zpe.thermalcorrener: 0.219306 hartree
zpe.thermalcorrenthalpy: 0.220250 hartree
zpe.thermalcorrgfe: 0.165550 hartree
zpe.sumelectzpe: -538.041878 hartree
zpe.sumelectthermal: -538.029458 hartree
zpe.sumelectthermalent: -538.028514 hartree
zpe.sumelectthermalfe: -538.083213 hartree
dipole: 0.9955 -4.8291 0.0056
dipole: 4.9306
quadrupole: -65.9983 -74.5949 -63.9819
quadrupole: -2.5602 0.1029 -0.0065
quadrupole: 2.1934 -6.4032 4.2098 -2.5602 0.1029 -0.0065
hfenergy: -538.2487637 hartree
pointgroup: C01 [X(C8H14O3)]
dipole: 0.3915799 1.8999194 0.0026987 debye
dipolederiv: -1.7904259 -0.167151 -0.0030059 -0.2175176 -0.5300211 -0.001778 -0.0035712 -0.0017485 -0.2814984 -0.6511743 0.0185975 0.0006926 0.0335101 -0.855682 0.0011179 0.0006211 0.0010487 -0.2791139 -0.7131816 0.0307899 -0.0003705 -0.3916662 -0.9268164 -0.0043253 -0.0028143 -0.0035603 -0.3101798 0.0040625 -0.0176524 -0.0001317 -0.0817029 0.0486268 -0.0005617 -0.0011369 0.0002331 0.1554654 -0.0979871 -0.0073232 -0.0002898 -0.0141409 0.0716562 -0.000384 -0.0002843 -0.0005261 0.1630193 -0.3917302 0.1406687 0.0016548 0.3138809 -0.1161476 -0.0016248 0.0047178 -0.0028322 0.1633549 0.847396 -0.0343377 0.0005242 -0.1743103 0.2398421 -0.0009779 -0.0003031 -0.0007305 0.3558013 1.1891399 0.0178536 -0.0049064 -0.049532 0.9829168 -0.0020496 -0.0058249 -0.0018087 0.0632918 -0.4510703 -0.2258642 0.002723 -0.2280805 -0.1927697 0.0029086 0.0052469 0.0044291 0.0379163 1.8191494 0.0681371 0.0026059 0.5754372 1.2392284 0.0072359 0.0055952 0.0065011 0.1883394 -0.2610047 0.162805 0.0006693 0.2341372 -0.2238678 -0.0013335 0.0013944 -0.001682 0.0322894 0.0600489 -0.0016961 0.0062432 -0.0099916 -0.0080372 0.0991738 -0.0038959 0.1048096 -0.0598173 0.059263 -0.0013307 -0.0059046 -0.0096733 -0.0060173 -0.0989136 0.0043513 -0.1045903 -0.0627619 0.0564321 -0.0034162 0.0066172 -0.0084484 -0.0213431 0.1063867 -0.0048893 0.1201584 -0.0712926 0.0564975 -0.0031469 -0.006409 -0.0084388 -0.018977 -0.105882 0.0049611 -0.1196623 -0.0738006 0.053329 0.0028509 -0.0173437 -0.0557271 0.0134876 -0.0940535 -0.0191292 -0.1226703 -0.0367513 0.0530422 0.0022453 0.0176036 -0.0568685 0.009976 0.0951307 0.0174442 0.1241209 -0.0340219 -0.0308573 0.0011387 0.0145754 0.0616536 -0.0040621 0.0786967 -0.0056688 0.0947344 -0.0609876 -0.0306983 0.0015718 -0.0145152 0.061853 -0.0023653 -0.0779331 0.0064333 -0.0940987 -0.0626475 0.0954775 0.0065681 0.0473765 0.0016216 0.0436757 -0.1014088 -0.0051658 -0.1190239 -0.0236294 -0.0799306 0.0525674 -0.0016794 0.1081239 0.0327633 0.0015604 -0.0024313 0.0006186 0.1225089 0.0956417 0.0043253 -0.0463837 0.0005026 0.0501195 0.0986296 0.0050743 0.1157028 -0.02906 0.092966 -0.0028767 0.0452373 0.0013797 0.0603694 0.0894443 0.0035948 0.1072355 -0.0101809 0.0930905 -0.0017357 -0.0448301 0.0018619 0.0631506 -0.0883313 -0.0032255 -0.1060921 -0.0131456 -0.0774756 -0.0435885 -0.0007529 -0.0878638 0.0502942 -0.0007279 -0.0010938 -0.0005662 0.1269016 unknown
polarizability: 124.8029503|1.4153283|94.4544313|0.0052326|0.0533775|68.2155477 unknown
InChI: InChI=1S/C8H14O3/c1-7(9)5-3-4-6-11-8(2)10/h3-6H2,1-2H3
charge 0 multiplicity 1
25 atoms
O  -2.514239 0.542373 0.000352
O  3.841527 -1.361604 0.005728
O  -3.869898 -1.354408 -0.012846
C  1.226646 -0.246337 0.000264
C  -0.0856 0.570142 0.003449
C  2.469996 0.660983 0.007214
C  -1.311376 -0.343471 -0.002523
C  3.799101 -0.102638 0.003595
C  5.07045 0.740657 -0.002126
C  -3.754879 -0.107864 -0.005453
C  -4.881196 0.902999 -0.000806
H  1.263615 -0.918229 0.878782
H  1.265743 -0.907997 -0.885941
H  -0.12537 1.233193 -0.882539
H  -0.126837 1.223618 0.896463
H  2.461164 1.33052 0.893756
H  2.462278 1.344109 -0.868721
H  -1.352556 -0.996663 0.888787
H  -1.350307 -0.988065 -0.900176
H  5.09515 1.412365 0.876996
H  5.958356 0.090396 0.009747
H  5.101983 1.387037 -0.899952
H  -4.806128 1.560097 -0.884531
H  -4.810003 1.547427 0.892538
H  -5.848021 0.380359 -0.006558
