program: Gaussian 09
title: 000240590
version: EM64L-G09RevD.01
frameworkgroup: C1[X(C5H10ClNOS)]
method: RPBEPBE
basis: SDD
operation: Freq
keyword: #p
keyword: freq=noraman
keyword: PBEPBE/SDD
title: #p freq=noraman PBEPBE/SDD
converged: YES YES NO NO
title: Mulliken charges:
elementType: Cl S O N C C C C C H H H H H H H H H H
charge: -0.097248 0.168935 -0.091810 -0.562551 -0.390355 -0.105621 -0.697728 -0.052141 -0.840534 0.225783 0.258299 0.292310 0.259802 0.286548 0.291321 0.286924 0.256279 0.257744 0.254043
chargesum: 0.00000
title: Mulliken charges with hydrogens summed into heavy atoms:
elementType: Cl S O N C C C C C
charge: -0.097248 0.168935 -0.091810 0.015693 0.093726 0.186689 -0.151378 -0.052141 -0.072468
polarizability: 9.87964254e+01 -7.98905281e-02 1.00702436e+02 -8.89396625e+00 4.86936186e+00 7.24479315e+01
1716.lowfreq: -19.8080 -3.4284 -0.0037 -0.0026 -0.0008 6.1808 25.0843 38.8170 49.5854
frequency: 23.6162 38.3644 49.3524 110.6813 129.3324 146.1921 209.5356 240.9116 254.8255 306.7129 315.9142 358.2608 381.3573 492.6414 596.6264 605.4933 634.9545 662.1288 689.7522 780.4005 859.8681 928.7038 957.7266 964.9961 1022.6846 1055.0920 1121.4290 1138.6339 1168.3022 1238.8896 1272.0066 1301.7827 1329.6661 1343.5936 1363.9848 1436.7216 1447.4656 1460.1399 1465.1631 1645.5114 1727.1438 2975.6503 3001.8895 3022.8475 3049.9106 3060.4647 3097.5840 3115.3891 3128.6338 3466.5689 3594.7613
redmass: 7.2868 9.0455 3.2667 2.0208 4.7520 1.4329 6.8983 2.9156 1.8083 2.0249 2.1397 2.4494 12.3007 3.5625 3.3514 1.5554 5.1241 6.7239 3.3434 2.7331 2.7108 1.8850 1.3584 1.2237 1.7801 2.3702 1.7400 1.8649 1.2190 1.4169 1.2860 1.1754 1.3357 1.1543 1.2818 1.0806 1.0629 1.0624 1.0643 1.0928 10.6440 1.0638 1.0292 1.0600 1.0911 1.0925 1.1046 1.1056 1.1022 1.0450 1.0987
irintensity: 0.8401 0.0891 0.6335 2.5997 0.7604 2.6593 1.1908 5.8113 37.9530 2.9070 38.8577 29.5951 19.1312 13.4667 36.1990 199.9605 13.2028 6.0646 53.8526 112.5195 58.3907 17.5930 8.1304 6.4975 21.2203 4.7163 23.6590 2.8489 10.2261 3.7200 2.1853 14.7209 5.5776 2.2539 2.9684 9.0183 17.9816 22.9023 14.3167 54.5372 246.5419 20.5544 32.6540 27.1007 8.6174 6.8864 7.6646 22.9502 10.2115 8.6843 7.3634
temp: 298.150 k
press: 1.00000 atm
elementType: 17 16 8 7 6 6 6 6 6 1 1 1 1 1 1 1 1 1 1
symmnumber: 1
zpe: 387531.8 jmol-1
zpe.correction: 0.147603 hartree
zpe.thermalcorrener: 0.159523 hartree
zpe.thermalcorrenthalpy: 0.160467 hartree
zpe.thermalcorrgfe: 0.107392 hartree
zpe.sumelectzpe: -1183.890569 hartree
zpe.sumelectthermal: -1183.878649 hartree
zpe.sumelectthermalent: -1183.877705 hartree
zpe.sumelectthermalfe: -1183.930780 hartree
dipole: 1.8576 3.6310 0.1457
dipole: 4.0812
quadrupole: -70.9772 -71.2994 -66.3081
quadrupole: -1.7338 5.0876 -0.6317
quadrupole: -1.4490 -1.7712 3.2202 -1.7338 5.0876 -0.6317
hfenergy: -1184.0381721 hartree
pointgroup: C01 [X(C5H10Cl1N1O1S1)]
dipole: 0.6964559 1.4422804 0.1135857 debye
dipolederiv: -0.2654166 -0.0048755 0.053762 -0.0188293 -1.1256845 -0.2226664 0.0328129 -0.3174111 -0.2313728 -0.231561 0.0598711 0.001352 0.1088181 -0.0823432 0.0846314 0.046995 0.040974 -0.133192 -0.770284 0.2017795 0.4106018 0.0543052 -0.607498 -0.1587822 0.371755 -0.2782783 -0.4939099 -0.5938612 -0.1604522 0.0474644 -0.0935292 -0.831511 0.2348101 0.0225361 0.2876923 -0.2571863 0.0410968 0.0190589 -0.0128455 -0.0111947 -0.0504713 0.0234421 0.1643311 0.0899932 0.0296624 0.1491442 0.0739728 0.0302583 -0.0771592 0.4819932 -0.2010896 0.0187259 -0.3369091 0.153762 0.2192795 -0.1017943 -0.1275423 -0.1372961 0.0546802 0.0116071 -0.159782 0.0643102 0.1671496 0.8709738 -0.3194892 -0.5176749 0.1239907 1.5537133 0.4403541 -0.5001351 0.734821 0.4758901 0.106104 0.0766534 0.0457124 0.0578778 0.0464747 -0.0418952 0.0202339 -0.0545914 0.0136778 -0.0328644 0.0937505 0.1153098 0.080542 0.0365158 -0.0793107 0.0391536 -0.0584156 -0.0600582 -0.0104775 -0.111031 0.0045553 -0.0866988 -0.007975 0.0341736 -0.0323975 0.0445586 0.0670822 0.1650835 -0.0156922 0.0501893 -0.0349899 -0.0106437 -0.0428197 0.0299795 -0.0181219 0.0067327 -0.0633868 0.0195354 -0.0920088 0.0289624 0.0640998 -0.0746955 -0.0481729 -0.0355945 -0.0967766 0.0255485 -0.0688503 0.0892589 -0.010989 -0.0104269 0.0282057 0.0973851 0.0042802 0.0667671 0.1452976 0.0894848 -0.156344 0.0287372 0.2010092 -0.0747877 -0.0950109 -0.0858953 0.1763374 0.2344577 0.1529893 0.046522 0.0752598 0.2893187 0.0093289 0.0536475 -0.0531131 0.0798958 0.0307729 0.0409335 -0.0291715 -0.0056429 -0.1443801 0.0663635 -0.0404785 0.0261478 0.0944232 -0.0168129 0.0075537 0.1059664 0.0144371 0.0934509 -0.032811 0.1167925 -0.0342285 0.0204817 -0.0030942 -0.0533981 -0.0653657 -0.0966012 0.049678 -0.0040583 -0.1383712 -0.0202184 -0.0793663 unknown
polarizability: 97.8205077|0.7598953|100.0009108|-10.275662|6.329223|74.1253746 unknown
InChI: InChI=1S/C5H10ClNOS/c1-9-3-2-4(7)5(6)8/h4H,2-3,7H2,1H3
charge 0 multiplicity 1
19 atoms
Cl -1.571137 -2.002417 -0.452764
S  2.305654 -0.979039 -0.460281
O  -2.698948 0.129451 0.86873
N  -1.126835 2.042224 -0.789772
C  0.462848 0.897424 0.720849
C  -0.619542 0.733321 -0.38523
C  1.293138 -0.363874 1.018309
C  -1.751572 -0.177798 0.155081
C  3.633173 0.357521 -0.499751
H  -0.019012 1.247224 1.657834
H  1.118119 1.715611 0.369856
H  -0.154427 0.227838 -1.24829
H  2.000347 -0.169564 1.843396
H  0.663598 -1.225033 1.297401
H  -1.693389 2.047683 -1.642512
H  -1.541947 2.597272 -0.034742
H  3.206091 1.336808 -0.767331
H  4.353991 0.050971 -1.273838
H  4.14505 0.412775 0.474853
