program: Gaussian 09
title: 000240606
version: EM64L-G09RevD.01
frameworkgroup: C1[X(C8H16O4S2)]
method: RPBEPBE
basis: SDD
operation: Freq
keyword: #p
keyword: freq=noraman
keyword: PBEPBE/SDD
title: #p freq=noraman PBEPBE/SDD
converged: YES YES NO NO
title: Mulliken charges:
elementType: S S O O O O C C C C C C C C H H H H H H H H H H H H H H H H
charge: 0.934074 0.877500 -0.545864 -0.544693 -0.562033 -0.560529 -0.301166 -0.447475 -0.459180 -0.414744 -0.496070 -0.482929 -0.640414 -0.634104 0.245311 0.344411 0.345271 0.250911 0.246527 0.228981 0.297913 0.305478 0.251182 0.267976 0.235686 0.252473 0.253502 0.233449 0.253871 0.264686
chargesum: 0.00000
title: Mulliken charges with hydrogens summed into heavy atoms:
elementType: S S O O O O C C C C C C C C
charge: 0.934074 0.877500 -0.545864 -0.544693 -0.562033 -0.560529 -0.301166 0.142247 0.137002 0.060764 0.107321 0.036229 0.101247 0.117902
polarizability: 1.85875830e+02 9.15921595e+00 1.55560064e+02 -2.16201564e-01 4.12463580e-02 1.27906650e+02
1716.lowfreq: -37.1532 -13.9161 -7.5228 -5.6737 0.0017 0.0019 0.0019 23.5207 35.2512
frequency: -36.8001 19.7540 35.2491 66.3496 69.8442 86.4861 117.2394 120.8332 149.7188 181.2172 184.2598 206.3073 212.9332 225.2542 236.5468 247.7966 256.6114 267.8341 293.3846 331.7699 339.5625 397.7409 401.9918 472.8591 476.0323 519.3009 546.9941 747.0055 776.4942 781.4920 788.0330 791.0175 797.9148 803.7348 898.3788 903.9853 905.4840 938.5443 968.3028 970.2784 1027.4863 1038.6012 1044.5021 1062.1072 1065.8062 1068.1695 1099.0336 1122.1207 1203.3111 1206.7637 1229.9279 1231.6474 1233.6538 1252.4938 1267.1661 1272.7136 1307.4722 1393.3873 1394.5076 1411.1476 1429.2351 1452.3060 1456.3696 1457.8537 1458.7899 1470.8529 1481.3952 1482.1757 2991.3712 2993.3345 3002.8443 3007.5961 3045.0194 3046.7281 3049.6026 3073.2323 3077.9813 3084.8669 3088.4099 3106.0647 3106.4084 3128.1785 3140.2430 3143.5319
redmass: 2.3244 3.2130 4.7548 4.1918 2.5424 3.5130 4.6171 5.4523 7.4030 1.4865 1.5040 4.6837 4.2475 4.3824 2.0346 4.8259 2.1227 3.5842 2.9687 7.9270 7.0845 4.8718 3.5594 5.5221 5.5593 8.7469 7.5316 4.8649 1.2385 1.1807 5.6613 1.2176 2.7632 2.0773 5.0099 3.0380 5.8427 3.7790 1.5666 1.5267 1.3974 4.6620 1.0951 2.7602 1.3896 2.5045 6.1460 1.9976 1.2520 1.1063 1.2422 1.2434 1.2505 1.2361 1.2207 1.3834 1.3634 1.1845 1.1673 1.1191 1.1110 1.0756 1.0750 1.0354 1.0354 1.1043 1.0515 1.0536 1.0368 1.0363 1.0610 1.0633 1.0579 1.0566 1.0604 1.1023 1.1010 1.0960 1.0972 1.1019 1.1030 1.1089 1.1105 1.1100
irintensity: 0.0127 2.5796 0.8499 8.5434 0.3489 3.5524 0.1524 0.9185 2.6896 0.3006 0.0248 0.4967 13.2010 36.3780 0.0886 17.6492 2.4518 10.2384 0.8642 12.7683 9.9063 0.9579 9.9478 30.7112 18.0574 13.4395 84.0983 9.6971 2.4059 4.7519 47.5548 0.3461 23.7606 35.3994 57.4881 11.2896 82.0943 0.1002 60.9798 17.3017 3.3799 1.0421 0.5448 10.9565 3.6403 6.7827 0.1571 7.1257 5.3288 0.1684 2.5246 12.0333 3.5261 10.9155 9.4519 26.1162 1.5077 31.4686 29.2047 1.2997 15.3782 50.2289 6.3097 21.2384 29.0757 11.4066 14.6132 10.6303 12.3926 12.9666 1.9303 16.4011 2.3233 7.8110 37.0450 0.2706 4.4662 6.1858 6.1709 3.0758 7.8521 9.7300 0.1941 6.4566
temp: 298.150 k
press: 1.00000 atm
elementType: 16 16 8 8 8 8 6 6 6 6 6 6 6 6 1 1 1 1 1 1 1 1 1 1 1 1 1 1 1 1
symmnumber: 1
zpe: 611536.7 jmol-1
zpe.correction: 0.232922 hartree
zpe.thermalcorrener: 0.250633 hartree
zpe.thermalcorrenthalpy: 0.251577 hartree
zpe.thermalcorrgfe: 0.186377 hartree
zpe.sumelectzpe: -1409.987561 hartree
zpe.sumelectthermal: -1409.969850 hartree
zpe.sumelectthermalent: -1409.968906 hartree
zpe.sumelectthermalfe: -1410.034106 hartree
dipole: 5.4515 1.6614 0.0280
dipole: 5.6991
quadrupole: -92.6249 -95.8451 -112.7430
quadrupole: 15.9306 0.6342 0.3747
quadrupole: 7.7795 4.5592 -12.3387 15.9306 0.6342 0.3747
hfenergy: -1410.2204831 hartree
pointgroup: C01 [X(C8H16O4S2)]
dipole: -2.1380049 -0.6745402 -0.0364498 debye
polarizability: 185.6750846|9.5715044|154.8582358|-0.1495888|4.7618101|128.8092232 unknown
InChI: InChI=1S/C8H16O4S2/c1-3-13(9,10)8(6-5-7-8)14(11,12)4-2/h3-7H2,1-2H3
charge 0 multiplicity 1
30 atoms
S  1.8901 -0.238409 0.184625
S  -1.243652 0.492383 0.508009
O  2.480666 -0.476886 -1.324708
O  2.601473 -1.011856 1.440225
O  -1.151349 1.525513 -0.764385
O  -0.899233 1.03184 2.01979
C  -0.057913 -0.985896 0.12448
C  -0.109055 -2.242087 1.004941
C  -0.225578 -1.767049 -1.184754
C  -0.131822 -3.088374 -0.327156
C  1.901217 1.685773 0.545018
C  -3.06811 -0.236673 0.553222
C  3.352757 2.14779 0.541637
C  -4.029153 0.944663 0.474335
H  -1.013071 -2.345363 1.629543
H  0.785439 -2.359422 1.644437
H  0.599828 -1.592846 -1.900154
H  -1.186746 -1.619827 -1.707026
H  0.802558 -3.645019 -0.498635
H  -0.995942 -3.76382 -0.427322
H  1.275338 2.088221 -0.268081
H  1.378952 1.754763 1.512623
H  -3.119392 -0.913114 -0.315023
H  -3.092217 -0.787643 1.506068
H  3.366874 3.236845 0.736806
H  3.940051 1.650073 1.331766
H  3.834628 1.967561 -0.434217
H  -5.067358 0.564525 0.449213
H  -3.92443 1.606609 1.350527
H  -3.852657 1.536726 -0.439905
