program: Gaussian 09
title: 000240597
version: EM64L-G09RevD.01
frameworkgroup: C1[X(C7H10N2O4S2)]
method: RPBEPBE
basis: SDD
operation: Freq
keyword: #p
keyword: freq=noraman
keyword: PBEPBE/SDD
title: #p freq=noraman PBEPBE/SDD
converged: YES YES NO NO
title: Mulliken charges:
elementType: S S O O O O N N C C C C C C C H H H H H H H H H H
charge: 0.957292 0.951658 -0.513805 -0.564636 -0.520031 -0.511475 0.012859 0.007864 -0.681211 -0.559915 -0.587421 -0.379331 -0.385765 -0.132345 -0.131272 0.297142 0.337763 0.293610 0.286665 0.300265 0.345537 0.299532 0.291731 0.305036 0.280255
chargesum: 0.00000
title: Mulliken charges with hydrogens summed into heavy atoms:
elementType: S S O O O O N N C C C C C C C
charge: 0.957292 0.951658 -0.513805 -0.564636 -0.520031 -0.511475 0.012859 0.007864 -0.046307 0.020359 0.058380 0.211932 0.199526 -0.132345 -0.131272
polarizability: 2.13181321e+02 -2.89761753e+00 1.42570660e+02 -2.82890402e+00 -1.29701641e+00 1.18232941e+02
1716.lowfreq: -10.5521 -3.3694 0.0018 0.0026 0.0032 3.2815 11.6589 14.8382 32.6990
frequency: 11.4935 14.5588 32.6711 38.9398 56.5046 66.2921 80.7933 94.9944 132.1509 161.0970 167.3306 172.1788 189.2118 194.6572 238.3094 245.5875 255.7455 322.6391 328.8464 362.3517 370.7237 374.3828 414.8561 449.7127 473.0330 539.9898 552.5254 593.3697 610.0924 753.5838 777.6359 782.3052 793.8329 809.5721 903.5429 918.1055 934.0139 941.6751 986.9303 1002.0329 1038.1717 1040.9676 1081.0494 1135.5592 1138.2653 1156.3917 1225.3571 1249.2151 1278.6132 1282.8355 1309.0388 1331.7365 1333.1680 1409.4390 1428.7095 1450.2460 1456.5810 2205.1681 2205.6076 2999.8785 3002.6266 3010.0670 3054.7614 3057.2534 3064.0056 3067.7394 3135.8818 3155.6653 3185.5039
redmass: 12.0552 5.1908 4.0849 9.4700 3.2533 3.6951 6.4740 5.5800 5.9400 6.9292 6.3995 9.2196 9.3702 8.5611 3.2214 4.9694 3.2548 10.5852 10.1037 7.0108 3.7285 3.7199 6.3287 7.3361 11.3969 8.9301 7.6684 5.6950 6.6974 2.0088 1.4159 1.2677 5.2454 6.3136 3.7202 4.3557 5.0327 3.9437 1.7707 1.9302 3.9006 3.7640 1.1941 1.1589 1.1661 1.1678 1.1833 1.1650 1.1253 1.1254 1.0798 1.3438 1.3557 1.0984 1.0894 1.0791 1.0783 12.4269 12.4312 1.0630 1.0589 1.0581 1.0542 1.0511 1.1018 1.1019 1.1076 1.1127 1.1168
irintensity: 0.0238 2.0209 2.2316 1.6514 12.0410 12.6914 3.4583 4.8544 9.6155 10.5268 11.6527 7.2278 1.9328 15.8560 6.8414 5.6577 1.6874 13.9813 21.5137 22.4494 0.8108 1.5229 0.7881 9.2329 2.4868 202.8760 35.3584 2.6930 3.4043 4.9615 7.6246 9.1563 44.9059 52.5546 61.8881 48.6340 4.2806 24.0848 28.6903 27.2059 11.1678 2.8822 2.9505 3.1590 0.6122 2.7398 2.7513 5.6600 1.0581 9.4061 7.0928 8.9257 21.6749 5.1713 3.9693 19.4411 21.0877 7.0950 5.6770 36.4452 5.8354 2.6310 7.2263 2.1940 0.4655 0.9428 13.8677 0.1423 5.5316
temp: 298.150 k
press: 1.00000 atm
elementType: 16 16 8 8 8 8 7 7 6 6 6 6 6 6 6 1 1 1 1 1 1 1 1 1 1
symmnumber: 1
zpe: 440451.7 jmol-1
zpe.correction: 0.167759 hartree
zpe.thermalcorrener: 0.186689 hartree
zpe.thermalcorrenthalpy: 0.187633 hartree
zpe.thermalcorrgfe: 0.115846 hartree
zpe.sumelectzpe: -1477.724647 hartree
zpe.sumelectthermal: -1477.705717 hartree
zpe.sumelectthermalent: -1477.704773 hartree
zpe.sumelectthermalfe: -1477.776560 hartree
dipole: 1.8240 -1.7768 -2.9488
dipole: 3.8960
quadrupole: -135.7397 -126.6794 -111.4199
quadrupole: 0.2509 2.2323 4.2395
quadrupole: -11.1267 -2.0664 13.1931 0.2509 2.2323 4.2395
hfenergy: -1477.8924066 hartree
pointgroup: C01 [X(C7H10N2O4S2)]
dipole: 0.7363535 0.8810074 -1.0154513 debye
dipolederiv: 1.405485 -0.0143929 -0.0165584 -0.2541824 1.0884162 -0.0370159 0.4926748 0.0409816 1.2003921 1.847796 0.0629452 0.2909204 0.340312 1.0936967 0.1009874 -0.2565577 -0.0140121 1.0840876 -0.6427067 0.0713643 -0.0560055 0.0903965 -0.567425 0.0566939 -0.0925188 -0.0388409 -0.458328 -0.8241406 0.0114086 0.0507702 0.1087776 -0.4942009 -0.1068806 0.0022675 -0.0091683 -0.5638363 -0.7365239 -0.0129897 -0.1161059 0.0702683 -0.4745444 0.0861554 -0.0164135 -0.0152195 -0.6732899 -0.5849317 -0.0000136 0.0146851 -0.1725041 -0.5939047 -0.0677155 0.1709502 0.0217527 -0.4923833 -0.25723 0.0120841 -0.0324892 -0.0479117 -0.2112176 -0.0199807 0.0379454 0.0078457 -0.2010433 -0.2291946 -0.0077455 0.0005758 0.0472134 -0.2107371 -0.0198031 0.0513021 0.0185246 -0.217754 -0.5658915 -0.0479503 -0.0313334 -0.0534149 -0.2219409 -0.0318522 -0.0668679 -0.0111291 -0.300578 0.0929652 0.0177147 0.044047 0.0790108 -0.0691301 0.0700049 -0.0880353 0.0392759 -0.057211 0.0043746 -0.0422292 -0.1516843 -0.1006198 -0.0782822 -0.0608137 -0.2165025 0.0154694 0.052335 -0.1283667 -0.0723047 -0.0477623 -0.3147767 0.0516655 -0.0235375 0.1967985 0.0800986 0.1787751 0.1671868 -0.0029611 0.0389445 0.1958514 0.0272356 -0.193208 0.1452984 -0.0480782 0.0142757 0.053246 0.0542538 -0.0289558 0.190897 0.0348021 0.0266698 -0.2118922 -0.037797 -0.0880644 -0.1030544 -0.0256495 0.0229688 -0.1604954 0.0415195 0.1569829 -0.0547899 0.056546 0.0666663 -0.0686233 -0.0248088 -0.0662184 -0.0391277 0.0158036 -0.0022452 -0.0807814 0.0198908 0.0368035 -0.0554905 0.0127677 -0.0333268 0.0122827 0.0912337 0.0284582 -0.0522036 -0.0023877 0.0396435 -0.0320184 -0.0038804 -0.017974 0.0363148 -0.007807 0.0150444 -0.0003947 0.0037142 0.0783378 0.0272294 -0.0220812 0.0199115 -0.0413554 0.0649546 -0.0269527 -0.0300948 -0.0251456 -0.0319466 0.0460287 0.02631 0.0312258 0.0009856 0.0123287 0.0331114 0.0516864 0.0120475 0.005874 0.2075093 -0.0233332 0.0346569 -0.0329601 0.0765375 -0.0191231 0.0779196 -0.0293263 0.0460127 0.1331816 -0.0151521 0.016903 0.0632539 0.0455473 0.0150475 0.0129612 -0.0283617 0.1261468 0.0835683 -0.0048196 0.0582656 0.0036871 0.1086289 -0.0331248 0.0051029 -0.0232589 0.0389857 0.1344502 0.0482859 -0.0135136 -0.0108924 0.0632633 0.0484204 -0.0260006 -0.0025653 0.092338 0.0251512 0.0031775 -0.0119468 -0.0110103 0.1135568 0.0046768 -0.0518539 -0.0308564 0.0237609 unknown
polarizability: 212.9378108|6.1908067|122.5472377|0.6261873|9.161637|138.4998724 unknown
InChI: InChI=1S/C7H10N2O4S2/c8-3-1-5-14(10,11)7-15(12,13)6-2-4-9/h1-2,5-7H2
charge 0 multiplicity 1
25 atoms
S  1.098811 -0.366412 0.044556
S  -1.808538 -0.420175 -1.508648
O  1.518802 -1.937733 0.101676
O  0.257006 0.342568 1.262585
O  -2.34063 0.204412 -2.922031
O  -1.982535 -1.998184 -1.153901
N  6.048721 1.388385 0.777578
N  -4.712596 1.110979 2.66288
C  0.112279 -0.004449 -1.589511
C  2.757124 0.656443 -0.142701
C  -2.547827 0.631713 -0.030791
C  3.68367 0.179137 0.991915
C  -3.713237 -0.183641 0.558385
C  4.992145 0.844081 0.879395
C  -4.266036 0.528156 1.722826
H  0.179514 1.072851 -1.802112
H  0.505692 -0.662258 -2.379215
H  2.446212 1.708129 -0.054023
H  3.141032 0.410199 -1.145016
H  -2.847528 1.570175 -0.520787
H  -1.702397 0.749392 0.670585
H  3.81697 -0.918254 0.933187
H  3.235673 0.408767 1.976832
H  -3.356756 -1.184582 0.865935
H  -4.515669 -0.336998 -0.186694
