program: Gaussian 09
title: 000240581
version: EM64L-G09RevD.01
frameworkgroup: C1[X(C7H10N2O3)]
method: RPBEPBE
basis: SDD
operation: Freq
keyword: #p
keyword: freq=noraman
keyword: PBEPBE/SDD
title: #p freq=noraman PBEPBE/SDD
converged: NO YES NO NO
title: Mulliken charges:
elementType: O O O N N C C C C C C C H H H H H H H H H H
charge: -0.193973 -0.218723 -0.251938 -0.260739 -0.403564 0.194155 0.136179 -0.681323 -0.681262 0.235819 0.273743 -0.740886 0.269098 0.244932 0.218964 0.269020 0.218975 0.244954 0.358828 0.251370 0.258169 0.258201
chargesum: 0.00000
title: Mulliken charges with hydrogens summed into heavy atoms:
elementType: O O O N N C C C C C C C
charge: -0.193973 -0.218723 -0.251938 -0.260739 -0.044736 0.194155 0.136179 0.051672 0.051687 0.235819 0.273743 0.026854
polarizability: 1.16099568e+02 4.14346701e+00 1.06202382e+02 -1.05403266e-03 8.10394547e-03 6.45662504e+01
1716.lowfreq: -14.4458 -9.6287 -4.8585 0.0003 0.0006 0.0008 58.3664 91.4324 148.6328
frequency: 58.3515 91.4267 148.6287 159.8721 172.4938 199.7305 204.8401 232.2685 237.9196 286.0842 305.7540 339.1052 369.4320 433.2752 452.8554 562.1482 590.9119 600.4757 650.7115 661.3153 668.1894 709.7610 747.5613 778.1631 911.9157 946.1346 953.6382 1007.2862 1039.1086 1044.2003 1077.8258 1118.5888 1172.6242 1202.7955 1254.2134 1286.9982 1305.7823 1328.3806 1368.0561 1386.8163 1389.4991 1430.6306 1448.5328 1454.6339 1471.2590 1472.7972 1491.5817 1615.0737 1676.6605 1702.9897 2999.4328 3000.9765 3010.0243 3096.2553 3097.3833 3100.8420 3125.6074 3128.4850 3138.0317 3573.8028
redmass: 4.5049 3.9139 1.1040 6.4328 3.8644 1.2320 5.3921 2.3007 1.0486 3.3409 2.6228 7.2964 4.6912 4.1154 5.2111 4.5671 3.1901 7.9632 3.9003 4.8990 1.3100 8.3373 4.2655 2.8331 2.8049 1.5036 2.2417 1.3033 1.7082 2.1862 3.7024 3.3055 4.0777 2.7385 4.3454 6.6157 4.4614 1.9768 1.1779 1.2094 1.2191 1.0816 1.0459 1.0489 1.0463 1.0720 1.0553 7.8344 7.5661 12.1289 1.0351 1.0357 1.0363 1.1004 1.0962 1.0997 1.1013 1.1008 1.1025 1.0801
irintensity: 0.1309 7.8004 0.0673 6.6062 2.0990 0.1634 7.0833 0.4747 0.4068 4.2770 1.1113 11.0937 0.0379 1.5505 7.4799 45.9289 3.2002 3.4459 7.8063 7.4033 76.9987 0.6544 73.2911 1.6336 30.6098 1.8704 3.2128 0.2515 8.1356 17.6230 66.4791 27.8177 10.4926 76.7523 25.9618 92.4679 560.4242 68.3847 22.4476 65.7932 35.0180 30.0322 18.1569 5.3962 2.9162 22.8255 11.3345 122.0860 710.2367 95.6004 22.1704 3.2761 0.7991 9.9773 5.9057 22.4411 0.4349 4.8081 12.3510 73.6515
temp: 298.150 k
press: 1.00000 atm
elementType: 8 8 8 7 7 6 6 6 6 6 6 6 1 1 1 1 1 1 1 1 1 1
symmnumber: 1
zpe: 445550.0 jmol-1
zpe.correction: 0.169701 hartree
zpe.thermalcorrener: 0.181836 hartree
zpe.thermalcorrenthalpy: 0.182780 hartree
zpe.thermalcorrgfe: 0.132114 hartree
zpe.sumelectzpe: -607.062550 hartree
zpe.sumelectthermal: -607.050415 hartree
zpe.sumelectthermalent: -607.049471 hartree
zpe.sumelectthermalfe: -607.100137 hartree
dipole: 0.2675 0.6222 0.0017
dipole: 0.6773
quadrupole: -79.9493 -75.4235 -67.4531
quadrupole: 0.4710 -0.0019 -0.0050
quadrupole: -5.6740 -1.1482 6.8222 0.4710 -0.0019 -0.0050
hfenergy: -607.2322512 hartree
pointgroup: C01 [X(C7H10N2O3)]
dipole: 0.0827242 0.2532999 0.0006781 debye
dipolederiv: -1.191231 -0.0912309 -0.0001925 -0.085212 -0.4775367 -0.0000049 -0.0001248 -0.0000284 -0.3343849 -0.7885063 -0.3804824 -0.0001352 -0.2478748 -1.0759728 -0.0002074 0.0000436 0.0000726 -0.3138162 -0.695586 0.0658756 0.0000225 0.2894668 -0.9699778 -0.0002124 0.0001725 -0.0003162 -0.3348479 -1.2844808 0.4619843 0.0003261 0.4847083 -1.2314542 -0.0001701 0.0002382 -0.0002664 -0.2847695 -1.40789 -0.2068931 -0.0000425 -0.5305303 -0.7389865 -0.0001003 -0.0002909 -0.0000602 -0.3286451 0.2639611 0.3665992 -0.0001242 0.3539057 0.0419851 -0.0000594 -0.0000611 0.00004 0.2904442 1.4738258 0.1306749 0.0003379 0.6017423 1.0722448 0.0000828 0.0003192 0.0000527 0.163026 -0.0704528 -0.000996 0.0076451 -0.0319686 -0.0172178 -0.0343592 -0.0334913 -0.0047237 -0.0218015 -0.0704033 -0.0009828 -0.0076612 -0.0320553 -0.0171137 0.0343579 0.033464 0.0047245 -0.0217999 1.8044188 0.2444878 0.0002098 -0.177027 1.7919734 0.0002763 0.0001261 0.0000766 0.2740971 1.697109 -0.409159 -0.0004126 -0.4054597 1.1653293 0.0003909 -0.0004762 0.0003878 0.1982389 -0.2719759 -0.1798682 0.000007 -0.2821353 -0.1647929 0.0000235 0.0000805 0.0000745 0.0138275 0.0640647 0.1066442 0.0207935 0.0807273 0.029911 -0.0159597 0.0021985 0.0137575 0.0914715 -0.0578762 -0.1036317 -0.0113752 -0.0664249 0.0691831 -0.0118692 0.0121731 -0.0097197 0.090951 0.1022172 -0.0157674 0.029849 -0.0138461 0.0073486 0.1152283 0.0189584 0.0661702 -0.0773614 0.0638583 0.1066132 -0.0207732 0.0807513 0.0298067 0.0160415 -0.0021811 -0.013684 0.0914241 0.1022144 -0.0157752 -0.0297992 -0.013826 0.0072803 -0.115275 -0.0189216 -0.0661917 -0.0772984 -0.0578218 -0.1035737 0.0113676 -0.0664178 0.0691806 0.0118792 -0.0121774 0.0097076 0.0909454 0.1723227 -0.0505321 -0.0000432 -0.044274 0.2136358 -0.0000129 -0.0000602 -0.0000255 0.3633051 -0.0511174 0.0494964 0.0000826 0.1289111 0.039632 -0.0000857 0.000125 -0.0000575 0.1242267 0.1016896 0.0132138 0.0458752 -0.0116114 0.0778083 -0.0722905 0.0181716 -0.0705504 0.0012711 0.1016598 0.013303 -0.0459573 -0.0115495 0.0777335 0.0723263 -0.0182859 0.0705597 0.0014961 unknown
polarizability: 115.2742517|4.9654286|107.0276983|-0.001781|0.0079758|64.5662504 unknown
InChI: InChI=1S/C7H10N2O3/c1-4(10)9-6(12)8-5(11)7(9,2)3/h8H,1-3H3
charge 0 multiplicity 1
22 atoms
O  -3.089359 0.086706 -0.000513
O  0.971137 2.447128 0.000172
O  1.936239 -1.752649 -0.001041
N  0.510441 0.075599 -0.000025
N  -1.216621 1.538395 -0.000066
C  -0.735721 -0.778925 0.000014
C  -1.855429 0.291543 -0.000312
C  -0.851437 -1.639482 -1.282195
C  -0.851767 -1.638994 1.282525
C  0.198076 1.462395 0.000251
C  1.815983 -0.497425 -0.000381
C  3.006609 0.441021 -0.000553
H  -0.075814 -2.420052 -1.276747
H  -1.850039 -2.108144 -1.304302
H  -0.735806 -1.022081 -2.190538
H  -0.076174 -2.419591 1.277563
H  -0.73633 -1.021248 2.190657
H  -1.850397 -2.1076 1.304574
H  -1.701145 2.43744 -0.000149
H  3.916334 -0.177336 -0.001225
H  2.997161 1.105511 0.880083
H  2.99636 1.106288 -0.880588
