program: Gaussian 09
title: 000240582
version: EM64L-G09RevD.01
frameworkgroup: C1[X(C8H12N2O3)]
method: RPBEPBE
basis: SDD
operation: Freq
keyword: #p
keyword: freq=noraman
keyword: PBEPBE/SDD
title: #p freq=noraman PBEPBE/SDD
converged: NO YES NO NO
title: Mulliken charges:
elementType: O O O N N C C C C C C C C H H H H H H H H H H H H
charge: -0.193154 -0.217063 -0.249392 -0.273324 -0.405128 0.233472 -0.380058 0.113347 -0.697028 0.237965 -0.703245 0.258748 -0.742427 0.230639 0.256295 0.219456 0.244317 0.266177 0.356002 0.226428 0.221256 0.229613 0.251267 0.258504 0.257334
chargesum: 0.00000
title: Mulliken charges with hydrogens summed into heavy atoms:
elementType: O O O N N C C C C C C C C
charge: -0.193154 -0.217063 -0.249392 -0.273324 -0.049126 0.233472 0.106877 0.113347 0.032922 0.237965 -0.025949 0.258748 0.024678
polarizability: 1.23661212e+02 -3.33707597e+00 1.12386995e+02 -3.58403881e+00 5.21754905e+00 8.02349527e+01
1716.lowfreq: -0.0008 -0.0003 0.0006 5.4393 11.5391 11.9430 55.5787 76.3933 84.5310
frequency: 55.5331 76.3904 84.5275 144.0807 149.9834 170.9474 192.1422 201.1098 230.3358 247.2200 254.8673 296.9397 338.2794 356.6819 369.8567 444.2228 483.9751 556.4442 593.4123 597.0482 646.0511 657.8098 665.2718 712.0465 740.9876 755.9810 825.1205 891.0786 936.0391 1007.4236 1030.6122 1038.8059 1047.0236 1053.1968 1082.3139 1123.2599 1136.2302 1189.1662 1235.7864 1274.5653 1290.4529 1315.0147 1329.3600 1339.3987 1385.9665 1390.5939 1398.1645 1431.2371 1448.5489 1454.2135 1467.9508 1481.6660 1485.0211 1486.8690 1614.4209 1678.7101 1705.0277 2983.7052 2999.5010 3008.9679 3011.6991 3065.9164 3084.6879 3092.2550 3095.2682 3097.2526 3124.4515 3136.8556 3573.4464
redmass: 3.9399 2.9795 3.9044 3.1761 1.3043 4.3436 1.8845 3.1275 1.0742 2.4857 2.1532 2.3844 6.6572 3.6683 4.6448 5.0986 3.7312 4.7804 3.2589 7.0658 3.9200 4.3866 1.3013 7.7155 3.1029 2.2639 1.6816 2.0062 2.5036 1.4093 2.3007 1.7015 2.5315 1.7716 3.2671 3.1047 3.7272 2.8430 2.7313 3.2528 3.2659 2.0058 1.8868 1.5857 1.2089 1.2226 1.2144 1.0836 1.0460 1.0742 1.0704 1.0511 1.0477 1.0446 7.7558 7.5822 12.1691 1.0366 1.0358 1.0365 1.0624 1.0991 1.0983 1.1016 1.0961 1.1000 1.1006 1.1024 1.0801
irintensity: 0.0158 0.6983 5.7858 4.1967 1.3944 4.3061 0.8660 5.6488 0.1251 2.2205 1.0478 1.8847 11.9167 1.1974 0.0287 6.3879 1.3258 40.0137 2.7182 4.9907 10.6511 9.6201 76.3028 0.5652 62.4724 14.0337 9.0540 7.1311 19.3918 16.8835 1.3971 8.9527 8.3656 10.8128 60.9088 44.0410 3.7502 46.8044 2.7763 37.5764 339.5724 224.9084 62.1999 49.6657 36.1559 47.2410 19.8210 29.4804 18.1920 10.3848 26.8353 11.3732 1.6296 18.1075 119.9177 687.2065 96.3471 21.0683 12.4163 0.8545 14.8175 10.1250 30.2897 18.9378 3.6457 21.5244 3.2625 12.4125 73.3110
temp: 298.150 k
press: 1.00000 atm
elementType: 8 8 8 7 7 6 6 6 6 6 6 6 6 1 1 1 1 1 1 1 1 1 1 1 1
symmnumber: 1
zpe: 519594.3 jmol-1
zpe.correction: 0.197903 hartree
zpe.thermalcorrener: 0.211389 hartree
zpe.thermalcorrenthalpy: 0.212333 hartree
zpe.thermalcorrgfe: 0.158439 hartree
zpe.sumelectzpe: -646.285913 hartree
zpe.sumelectthermal: -646.272427 hartree
zpe.sumelectthermalent: -646.271483 hartree
zpe.sumelectthermalfe: -646.325377 hartree
dipole: -0.2309 0.4790 0.2826
dipole: 0.6022
quadrupole: -86.1826 -81.4151 -73.9339
quadrupole: -1.1190 1.2709 -1.8879
quadrupole: -5.6721 -0.9046 6.5766 -1.1190 1.2709 -1.8879
hfenergy: -646.4838159 hartree
pointgroup: C01 [X(C8H12N2O3)]
dipole: -0.0731546 -0.2014825 -0.1009069 debye
dipolederiv: -1.1702302 -0.0530209 -0.0692885 -0.034514 -0.4638163 -0.0064245 -0.0643325 -0.0151415 -0.3430081 -0.8107344 -0.3893547 -0.0650066 -0.2566065 -1.0258113 -0.0835523 -0.0616972 -0.1101758 -0.324057 -0.674576 0.0551263 0.0014214 0.2674678 -0.9607551 -0.062216 0.0201385 -0.0793219 -0.3462198 -1.2204004 0.4549775 0.0065668 0.4726697 -1.2566469 -0.0759394 0.0182352 -0.0784828 -0.3102165 -1.4102997 -0.1675212 -0.0864193 -0.4736801 -0.6817552 -0.0610928 -0.1318158 -0.0334905 -0.341879 0.2948943 0.3326667 0.0245765 0.3257295 -0.0152851 -0.0214144 0.0503055 -0.018619 0.2215125 -0.0016413 0.0100521 -0.0191234 -0.0236191 0.0626391 -0.0487672 0.003772 -0.0801369 0.0842695 1.4592775 0.0978927 0.1234568 0.5473249 0.9975953 0.1044204 0.1532231 0.0958548 0.198338 -0.0671576 0.0038832 0.0120196 -0.0207434 -0.0020656 -0.014112 -0.0407423 0.0007241 -0.0335373 1.7663018 0.2487978 0.1069132 -0.1602231 1.7617368 0.1281651 0.0673257 0.1843524 0.3017779 0.085572 -0.0176188 -0.0021094 -0.0155744 0.0310223 0.0178332 0.0021617 -0.0109689 -0.087003 1.6434967 -0.4191472 0.0020136 -0.4284216 1.1701206 0.1017712 0.0177634 0.0891934 0.211558 -0.2905441 -0.1696026 -0.0367589 -0.2723591 -0.1339448 -0.0337198 -0.051698 -0.0272068 0.0092796 -0.0717715 -0.1050689 -0.042133 -0.0593337 0.0603914 -0.0168639 -0.0322694 -0.004365 0.0276982 0.0712246 0.1069165 0.0040841 0.0770176 -0.0014451 -0.0198788 0.0132083 -0.0215637 0.0293027 0.0929622 -0.0310856 0.0461447 -0.0310066 -0.0164778 0.1192173 0.0295544 0.0676591 -0.0585525 -0.0651984 -0.0899909 -0.0350329 -0.0566952 0.0801349 -0.0178869 -0.0055584 -0.0168281 0.0890174 0.0701684 0.0981015 0.0300925 0.0771333 0.0167767 -0.0234079 0.0108146 0.0123126 0.0932629 0.1669883 -0.045413 -0.0157877 -0.0406682 0.2235397 -0.0217627 -0.0140872 -0.0278596 0.3564915 -0.013547 0.1070336 0.0264162 0.1129141 -0.0411677 -0.0617752 -0.0177503 -0.0182751 0.075136 -0.1123482 -0.0763771 -0.0595416 -0.077438 0.0414634 -0.0551934 -0.0143329 -0.0318655 0.0800739 0.0944217 -0.0298394 0.0340559 -0.039396 -0.0298909 0.1376143 0.0324118 0.1128976 -0.0601374 -0.0416117 0.0535321 -0.0019847 0.1340324 0.0306723 -0.0040811 0.0064355 -0.0080527 0.1224809 0.1043712 0.0121616 -0.0346975 -0.0168122 0.0580469 0.0810442 -0.0088751 0.0789019 0.0188257 0.1003819 0.0128987 0.0501221 -0.0071979 0.0949224 -0.0619774 0.0178094 -0.059542 -0.0144143 unknown
polarizability: 122.9615698|4.5180174|113.5878374|2.5650246|3.8593204|79.7337527 unknown
InChI: InChI=1S/C8H12N2O3/c1-4-8(3)6(12)9-7(13)10(8)5(2)11/h9H,4H2,1-3H3
charge 0 multiplicity 1
25 atoms
O  2.996477 -0.367555 0.350251
O  -1.166975 -2.470567 -0.181913
O  -1.921169 1.741377 0.306434
N  -0.588632 -0.149044 0.149886
N  1.058563 -1.697954 0.060593
C  0.695107 0.625325 0.335913
C  0.94254 1.662333 -0.799546
C  1.756453 -0.498827 0.255502
C  0.767264 1.292635 1.731196
C  -0.347522 -1.540678 -0.01151
C  0.844644 1.093615 -2.22912
C  -1.860485 0.491608 0.147619
C  -3.093682 -0.369492 -0.040137
H  1.957141 2.067998 -0.625821
H  0.219639 2.484101 -0.6622
H  0.552185 0.566281 2.534939
H  1.785717 1.688713 1.883819
H  0.038408 2.115804 1.789133
H  1.495568 -2.617096 -0.024948
H  1.59095 0.297888 -2.409521
H  -0.15949 0.681749 -2.437657
H  1.03257 1.894424 -2.96568
H  -3.969775 0.295087 -0.009995
H  -3.173103 -1.140457 0.745186
H  -3.063989 -0.917668 -0.997323
