program: Gaussian 09
title: 000240584
version: EM64L-G09RevD.01
frameworkgroup: C1[X(C9H16N2O2)]
method: RPBEPBE
basis: SDD
operation: Freq
keyword: #p
keyword: freq=noraman
keyword: PBEPBE/SDD
title: #p freq=noraman PBEPBE/SDD
converged: YES YES NO NO
title: Mulliken charges:
elementType: O O N N C C C C C C C C C H H H H H H H H H H H H H H H H
charge: -0.218744 -0.231648 -0.450749 -0.407392 0.328470 -0.082507 -0.095674 0.101272 -0.734914 -0.732654 -0.743697 -0.730425 0.153756 0.206781 0.249371 0.317144 0.267192 0.211381 0.217210 0.234989 0.219626 0.231475 0.203932 0.229414 0.231014 0.220357 0.216389 0.244323 0.344311
chargesum: 0.00000
title: Mulliken charges with hydrogens summed into heavy atoms:
elementType: O O N N C C C C C C C C C
charge: -0.218744 -0.231648 -0.133605 -0.063080 0.328470 0.124273 0.153696 0.101272 -0.039132 -0.046565 -0.079338 -0.049356 0.153756
polarizability: 1.30265448e+02 -3.63573499e-02 1.04091953e+02 4.48669790e+00 -3.50345246e+00 1.04098449e+02
1716.lowfreq: -11.4411 0.0008 0.0008 0.0008 1.5659 16.4833 74.0117 83.8427 111.7520
frequency: 73.8847 83.6053 111.7068 149.2459 165.9504 169.9107 193.2216 219.4254 234.1493 243.8932 258.1629 298.4928 318.3875 329.9736 355.4466 395.8154 415.5713 434.7799 471.2921 502.4782 569.0207 607.3741 624.0399 648.7990 693.1737 729.7679 736.2199 863.2440 881.3805 919.0788 930.0791 948.8699 958.4291 966.6692 975.7106 1010.9895 1017.7622 1110.3010 1122.5262 1148.5497 1170.4523 1180.6690 1184.4401 1214.7939 1295.3988 1301.8604 1310.0642 1314.6925 1320.5501 1332.6926 1362.8976 1382.1721 1385.3314 1399.5611 1402.3497 1469.4481 1473.6454 1476.3031 1477.5906 1485.9258 1489.4067 1491.4465 1497.8420 1667.6440 1716.9433 2966.8336 2976.8005 2981.6007 2982.0990 2986.6642 3015.6120 3065.9270 3074.9121 3077.2377 3077.8456 3081.0661 3084.0810 3084.2207 3092.9624 3584.9359 3605.0893
redmass: 5.7759 2.6124 2.6584 4.6240 5.6576 3.5797 2.7462 1.0804 1.0628 1.1566 1.2042 2.8882 3.6410 2.7622 3.0056 4.4155 2.5999 2.0609 1.3270 3.3947 3.0211 10.4567 2.6520 1.4069 5.8687 6.1224 4.1801 2.9176 2.4011 1.1858 1.1822 1.6222 1.5262 2.8267 1.9874 3.2156 1.8254 2.3736 2.1232 2.9787 2.3322 2.0823 2.0496 3.9436 1.4275 1.9725 1.5090 1.7720 1.6914 1.9170 1.6120 1.2205 1.2140 1.2088 1.1988 1.0507 1.0471 1.0412 1.0523 1.0512 1.0489 1.0453 1.0517 8.3318 9.2047 1.0822 1.0378 1.0359 1.0359 1.0362 1.0833 1.0978 1.0997 1.0995 1.0989 1.0995 1.0992 1.0991 1.1002 1.0802 1.0796
irintensity: 0.1494 0.2182 0.0039 2.4688 1.3603 0.6355 0.5080 0.1028 0.1139 0.6262 0.1177 3.1672 2.4035 2.2426 1.6927 11.3584 3.6852 19.2351 85.2200 7.0475 7.7039 9.0023 36.1267 94.5262 2.3311 63.4548 25.3414 1.6977 1.2053 3.7723 6.1487 3.1346 2.7846 9.3897 9.8199 12.5960 23.9965 2.3145 5.8985 24.1333 2.7662 11.9663 3.3214 87.0424 22.7607 83.3808 5.1718 19.5492 39.7389 50.4576 0.1377 15.5380 19.4078 38.8606 8.2701 1.5356 4.8228 5.4145 3.6907 20.0235 9.0084 19.8427 12.3047 426.1039 449.1582 20.0838 32.9416 40.0855 9.2629 24.0261 5.3846 14.9128 13.0987 34.6683 45.5264 38.5950 62.6314 8.0035 19.9506 68.3818 32.9616
temp: 298.150 k
press: 1.00000 atm
elementType: 8 8 7 7 6 6 6 6 6 6 6 6 6 1 1 1 1 1 1 1 1 1 1 1 1 1 1 1 1
symmnumber: 1
zpe: 642570.4 jmol-1
zpe.correction: 0.244742 hartree
zpe.thermalcorrener: 0.258882 hartree
zpe.thermalcorrenthalpy: 0.259826 hartree
zpe.thermalcorrgfe: 0.205474 hartree
zpe.sumelectzpe: -611.528112 hartree
zpe.sumelectthermal: -611.513972 hartree
zpe.sumelectthermalent: -611.513028 hartree
zpe.sumelectthermalfe: -611.567379 hartree
dipole: 2.9661 0.7354 -1.6122
dipole: 3.4551
quadrupole: -89.0988 -76.7221 -83.3715
quadrupole: 2.5896 -9.7719 1.4511
quadrupole: -6.0347 6.3420 -0.3073 2.5896 -9.7719 1.4511
hfenergy: -611.7728537 hartree
pointgroup: C01 [X(C9H16N2O2)]
dipole: -1.1827931 -0.3185767 -0.5893468 debye
polarizability: 130.0430819|-0.3837145|104.5072097|-5.0571428|3.5179311|103.9055586 unknown
InChI: InChI=1S/C9H16N2O2/c1-5(2)9(6(3)4)7(12)10-8(13)11-9/h5-6,10-11H,1-4H3
charge 0 multiplicity 1
29 atoms
O  -0.0855 0.8521 2.160441
O  3.177397 -0.18155 -1.082882
N  0.799631 -0.372444 -1.075651
N  1.778989 0.453611 0.755298
C  -0.336724 -0.08166 -0.167933
C  -1.263462 1.036276 -0.790509
C  -1.110833 -1.393047 0.229379
C  0.419883 0.470576 1.075712
C  -2.53622 1.304234 0.048264
C  -0.489722 2.356919 -1.026395
C  -1.831914 -2.028063 -0.98366
C  -0.183247 -2.430742 0.905205
C  2.045365 -0.060009 -0.556438
H  -1.572178 0.648437 -1.784466
H  -1.866852 -1.08252 0.97528
H  0.696803 -0.738254 -2.020025
H  -2.271129 1.563873 1.087988
H  -3.093152 2.152921 -0.389066
H  -3.218892 0.436744 0.071874
H  -0.248039 2.853141 -0.068396
H  -1.111616 3.055634 -1.614395
H  0.449932 2.1932 -1.583174
H  -1.107419 -2.357544 -1.753692
H  -2.388013 -2.926051 -0.659457
H  -2.556061 -1.34293 -1.458449
H  0.63682 -2.739032 0.230778
H  -0.761323 -3.334989 1.168391
H  0.260904 -2.039672 1.83792
H  2.526973 0.760441 1.37786
