program: Gaussian 09
title: 000240576
version: EM64L-G09RevD.01
frameworkgroup: C1[X(C6H7BrN2S2)]
method: RPBEPBE
basis: SDD
operation: Freq
keyword: #p
keyword: freq=noraman
keyword: PBEPBE/SDD
title: #p freq=noraman PBEPBE/SDD
converged: NO NO NO NO
title: Mulliken charges:
elementType: Br S S N N C C C C C C H H H H H H H
charge: 0.051285 0.282428 0.292605 0.059257 0.037768 -0.203191 -0.090461 -0.404991 -0.243882 -0.823488 -0.828240 0.269107 0.250214 0.278362 0.278444 0.272715 0.272818 0.249250
chargesum: 0.00000
title: Mulliken charges with hydrogens summed into heavy atoms:
elementType: Br S S N N C C C C C C
charge: 0.051285 0.282428 0.292605 0.059257 0.037768 -0.203191 -0.090461 -0.404991 0.025226 -0.016468 -0.033458
polarizability: 2.04632120e+02 -1.35928600e+00 1.48469936e+02 -1.42425360e-03 3.18117956e-02 5.44270143e+01
1716.lowfreq: -3.5210 -0.0016 -0.0016 0.0009 6.0151 6.9098 47.6838 72.8537 94.0895
frequency: 47.5956 72.8160 94.0878 110.8156 117.3780 130.6504 134.3377 174.4165 196.7012 242.0750 283.7827 325.4323 382.0385 419.9298 427.6986 517.1847 605.3490 643.5213 664.1231 674.4356 757.5207 784.6142 923.5391 951.3370 976.4040 981.0777 989.7055 993.8245 1159.1051 1172.3275 1227.3160 1250.9642 1338.1873 1351.1165 1357.3788 1434.4062 1439.3053 1443.1806 1454.2135 1462.4068 1481.2997 3020.8833 3024.5542 3143.8372 3148.8407 3149.5831 3155.1480 3158.8486
redmass: 4.0940 4.4340 3.7915 1.0901 4.1528 9.2462 1.1841 5.1312 3.9403 8.6320 10.8726 5.6734 15.6852 7.5521 3.8450 10.5262 11.3501 8.1957 7.5046 8.2957 9.6588 10.2514 1.4174 12.2068 1.1804 1.1791 1.2722 1.2795 5.7649 3.6335 9.2299 10.4974 1.2445 1.1643 1.5833 1.0527 1.0527 1.0574 1.3511 3.2999 5.3119 1.0283 1.0282 1.1039 1.1040 1.1056 1.1057 1.0936
irintensity: 0.5430 2.1342 2.5573 0.0527 0.0963 2.0778 0.1880 0.1444 2.0023 3.3696 0.7158 3.7551 0.2717 11.9652 3.9600 16.4844 0.1403 9.1910 1.2094 12.8282 4.6686 33.3404 8.6802 25.3370 2.9052 13.6065 0.5032 5.6262 25.8794 227.7327 99.6575 2.5642 104.0067 8.9337 222.6178 2.1579 29.9961 18.1634 99.1005 60.9833 170.7094 15.8172 19.0926 12.9185 5.8263 12.9988 11.1757 7.1087
temp: 298.150 k
press: 1.00000 atm
elementType: 35 16 16 7 7 6 6 6 6 6 6 1 1 1 1 1 1 1
symmnumber: 1
zpe: 316982.3 jmol-1
zpe.correction: 0.120732 hartree
zpe.thermalcorrener: 0.133413 hartree
zpe.thermalcorrenthalpy: 0.134357 hartree
zpe.thermalcorrgfe: 0.079595 hartree
zpe.sumelectzpe: -1151.086483 hartree
zpe.sumelectthermal: -1151.073802 hartree
zpe.sumelectthermalent: -1151.072858 hartree
zpe.sumelectthermalfe: -1151.127620 hartree
dipole: 1.1532 3.1466 0.0002
dipole: 3.3512
quadrupole: -84.6009 -85.1890 -90.7704
quadrupole: 12.1867 0.0194 -0.0128
quadrupole: 2.2525 1.6645 -3.9170 12.1867 0.0194 -0.0128
hfenergy: -1151.2072147 hartree
pointgroup: C01 [X(C6H7Br1N2S2)]
dipole: 0.4117542 -1.2524033 -0.017267 debye
dipolederiv: -0.779486 0.0732117 0.0636469 0.048964 -0.0448697 -0.0032053 0.063753 -0.0052119 0.0108422 0.0482119 -0.322367 -0.0042903 -0.2051344 -0.6282571 0.0241472 -0.0062442 0.0326038 -0.0613443 -0.7727165 0.0711124 0.058128 -0.033893 0.1031746 0.0009446 0.0591556 -0.0074793 -0.0595101 -1.2143501 -0.5307324 0.0975191 -0.5094761 -0.7280306 0.0498082 0.0968231 0.0507866 -0.1131457 -1.2137101 -0.187121 0.0868006 0.4053356 -0.4874576 -0.029602 0.0794367 0.0188717 -0.1908279 0.2297387 0.5467539 -0.0232725 0.3280141 1.3775993 -0.0438801 -0.0201793 -0.0611224 0.0393639 1.0442077 -0.1122373 -0.0892994 -0.2075656 -0.8434351 0.026707 -0.0882437 0.0189599 -0.0720701 1.9797311 0.1231673 -0.1629313 0.0448383 0.3586906 -0.0081241 -0.1620123 -0.0146422 0.0287751 0.420464 0.3444253 -0.0376911 0.1183214 0.5736059 -0.0165537 -0.0346367 -0.0347037 0.0180323 0.0471447 -0.0531562 0.000818 -0.0685399 0.1550704 0.0038682 0.0011641 0.0030545 0.0477073 0.0779656 -0.1113532 -0.0012318 -0.0942984 0.0888943 0.0078039 -0.0012168 0.0089949 0.0470851 0.0260008 0.0708621 0.0073483 0.0858318 0.0150677 -0.0055711 0.0070787 -0.0043936 0.1261568 0.066554 -0.0625756 0.0059253 -0.0374453 -0.0954923 0.0061851 0.0055788 0.0082251 0.1291103 -0.0246344 0.0890949 -0.0930855 0.0006126 0.0707334 -0.0438819 -0.0628012 -0.0429765 -0.0029253 -0.000008 0.097149 0.0897982 0.0092306 0.0731482 0.0404352 0.061865 0.0256166 -0.0296851 0.0883572 -0.0338838 -0.0827921 0.045678 -0.0388824 -0.0839709 -0.066969 -0.057524 -0.0115087 0.1099706 -0.0226848 0.0634929 0.0592672 -0.03574 0.0753851 0.0460099 0.0622104 -0.0354921 -0.1334412 0.0203349 0.0211167 0.010259 0.0861804 -0.0004953 0.0214383 -0.00127 0.1294365 unknown
polarizability: 203.6712807|-0.6265886|148.4270026|-12.1466652|-1.1440208|55.4307867 unknown
InChI: InChI=1S/C6H7BrN2S2/c1-10-5-4(7)3-8-6(9-5)11-2/h3H,1-2H3
charge 0 multiplicity 1
18 atoms
Br -3.528557 0.651957 0.222519
S  -1.58198 -2.107515 0.099803
S  2.910341 1.031825 -0.306003
N  0.555924 -0.383369 -0.095331
N  0.43384 2.047152 -0.115567
C  -0.79895 -0.47243 0.01587
C  -1.587633 0.709926 0.064828
C  1.110406 0.859312 -0.155534
C  -0.921315 1.951788 -0.004383
C  -0.059663 -3.204519 -0.00535
C  3.435202 -0.771674 -0.329353
H  -1.482037 2.891055 0.029718
H  -0.444019 -4.235417 0.040023
H  0.608927 -2.998472 0.841976
H  0.466748 -3.024389 -0.952827
H  2.984633 -1.283526 -1.191387
H  3.128844 -1.26456 0.604046
H  4.532892 -0.754941 -0.417752
