program: Gaussian 09
title: 000240565
version: EM64L-G09RevD.01
frameworkgroup: C1[X(C5H5BrN2OS)]
method: RPBEPBE
basis: SDD
operation: Freq
keyword: #p
keyword: freq=noraman
keyword: PBEPBE/SDD
title: #p freq=noraman PBEPBE/SDD
converged: NO NO NO NO
title: Mulliken charges:
elementType: Br S O N N C C C C C H H H H H
charge: 0.070991 0.253599 -0.221958 -0.346704 0.019411 -0.186733 0.247611 -0.256186 -0.222243 -0.803877 0.351404 0.263656 0.290404 0.290626 0.250000
chargesum: 0.00000
title: Mulliken charges with hydrogens summed into heavy atoms:
elementType: Br S O N N C C C C C
charge: 0.070991 0.253599 -0.221958 0.004700 0.019411 -0.186733 0.247611 -0.256186 0.041412 0.027153
polarizability: 1.87238172e+02 7.89284929e+00 9.95727353e+01 -5.28293621e-03 -2.48923778e-03 4.15435147e+01
1716.lowfreq: -4.8902 -0.0021 -0.0020 -0.0011 2.8556 8.9363 57.4654 69.7102 101.5056
frequency: 57.4585 69.7099 101.5037 130.7853 155.5276 192.6509 248.7500 286.6866 289.8369 387.7766 455.9254 531.5957 536.5110 635.9452 662.1553 681.2918 713.0301 764.2888 898.1746 917.1721 967.1563 990.0376 1001.2631 1118.8134 1124.8700 1246.3103 1329.3024 1350.6479 1412.2167 1434.5549 1449.4569 1493.5916 1517.2541 1647.5284 3030.1588 3155.7906 3165.3044 3167.4895 3479.1501
redmass: 3.3216 6.0589 1.1892 5.1393 6.2244 7.5273 16.8902 6.5549 11.4483 2.9383 9.3954 8.7228 8.7610 7.9849 7.5703 8.0846 2.0139 2.5646 6.8966 1.4167 9.0199 1.1745 1.2833 5.3627 3.3655 3.4081 1.6041 1.1357 2.5173 1.0512 1.0611 4.5423 5.5127 7.6505 1.0283 1.1042 1.0934 1.1062 1.0778
irintensity: 1.8993 0.1420 0.0071 0.9898 11.2483 1.4473 0.4777 1.7071 0.0120 15.7697 15.7687 2.4030 27.0368 6.0809 6.7901 0.2853 13.4770 91.0144 3.8228 10.4465 86.9506 9.0348 4.8746 38.1808 97.7474 68.6685 4.8694 8.1128 6.9599 15.7359 9.0038 331.6369 135.2424 449.4318 14.9271 5.4564 10.7025 6.5685 41.2111
temp: 298.150 k
press: 1.00000 atm
elementType: 35 16 8 7 7 6 6 6 6 6 1 1 1 1 1
symmnumber: 1
zpe: 255986.9 jmol-1
zpe.correction: 0.097500 hartree
zpe.thermalcorrener: 0.107820 hartree
zpe.thermalcorrenthalpy: 0.108764 hartree
zpe.thermalcorrgfe: 0.059545 hartree
zpe.sumelectzpe: -789.041492 hartree
zpe.sumelectthermal: -789.031172 hartree
zpe.sumelectthermalent: -789.030228 hartree
zpe.sumelectthermalfe: -789.079447 hartree
dipole: -4.4981 -2.3322 0.0008
dipole: 5.0667
quadrupole: -66.5926 -76.5815 -76.0017
quadrupole: -3.6477 0.0057 0.0067
quadrupole: 6.4660 -3.5229 -2.9431 -3.6477 0.0057 0.0067
hfenergy: -789.1389918 hartree
pointgroup: C01 [X(C5H5Br1N2O1S1)]
dipole: -1.9018889 0.5686153 0.1821547 debye
dipolederiv: -0.6533268 -0.1955994 0.044135 -0.2679051 -0.0768606 0.0162108 0.0405801 0.010544 0.0212053 -0.801657 -0.0098744 0.0583633 -0.2373607 -0.0766811 0.0187125 0.046892 0.0001667 -0.0711491 -0.7862273 0.3933757 0.0553347 0.5455518 -0.8933712 -0.0720018 0.0631428 -0.0597473 -0.3611847 -1.0648491 0.4236199 0.0888435 -0.1623167 -0.4094684 0.0039838 0.0580448 -0.0429373 -0.2407075 -1.2089493 -0.0922452 0.0768661 -1.0185598 -0.7766155 0.0509063 0.0281448 -0.0234529 -0.19375 1.4655858 0.0143685 -0.1118488 1.0223269 0.8167208 -0.0424727 -0.0589869 0.0385235 0.0671589 1.0604046 -0.6623894 -0.0978773 -0.6086902 1.124366 0.0934045 -0.0948556 0.0976761 0.2829829 0.7960034 0.4162051 -0.0556762 0.8072674 -0.4417485 -0.0790954 -0.0354464 -0.0479401 -0.167143 0.7071095 -0.0958478 -0.0610083 0.0649063 0.3972254 0.0152614 -0.0524886 0.0281576 0.0135186 0.1618868 -0.1155015 -0.015043 -0.1674492 0.1061094 0.0156041 -0.0177361 0.0114989 0.0526693 0.159995 -0.0216401 0.0128286 -0.0140359 0.1970541 -0.0061227 0.0132045 -0.0055574 0.3334877 0.066589 -0.0351763 0.0039956 -0.0828554 -0.0350102 -0.0024981 0.0014795 -0.0063461 0.1388477 0.1062421 0.0036187 0.036721 0.0830507 -0.0096968 0.0702267 0.0340211 0.0509759 -0.0055397 0.0931102 -0.0004501 -0.0543128 0.0738308 0.0036111 -0.0824549 -0.0436284 -0.0505862 -0.0039699 -0.1019169 -0.0224637 0.0186786 -0.037761 0.0743655 0.0003355 0.0176326 -0.0009754 0.1335737 unknown
polarizability: 186.2064868|9.0151241|99.5898151|-11.1316262|2.320419|42.5581198 unknown
InChI: InChI=1S/C5H5BrN2OS/c1-10-5-7-2-3(6)4(9)8-5/h2,8H,1H3
charge 0 multiplicity 1
15 atoms
Br 3.358073 1.181991 -0.159985
S  -2.796852 -0.924062 0.223196
O  2.15545 -1.822253 -0.220368
N  -0.096757 -1.214122 -0.008481
N  -0.858462 1.034158 0.170692
C  -1.101267 -0.272749 0.121368
C  1.30881 -0.897829 -0.104406
C  1.530118 0.552359 -0.045993
C  0.470042 1.437106 0.085312
C  -3.745338 0.688756 0.384952
H  -0.309938 -2.218775 -0.04462
H  0.641749 2.516505 0.128233
H  -3.566844 1.309623 -0.50293
H  -3.415371 1.2183 1.28843
H  -4.804012 0.395394 0.459302
