program: Gaussian 09
title: 000240566
version: EM64L-G09RevD.01
frameworkgroup: C1[X(C5H4BrClN2O2S)]
method: RPBEPBE
basis: SDD
operation: Freq
keyword: #p
keyword: freq=noraman
keyword: PBEPBE/SDD
title: #p freq=noraman PBEPBE/SDD
converged: YES YES NO NO
title: Mulliken charges:
elementType: Br Cl S O O N N C C C C C H H H H
charge: 0.125718 0.068902 0.941085 -0.530189 -0.532494 0.108959 0.109782 -0.261257 -0.726426 -0.165446 -0.209410 -0.057805 0.276287 0.284272 0.280582 0.287442
chargesum: 0.00000
title: Mulliken charges with hydrogens summed into heavy atoms:
elementType: Br Cl S O O N N C C C C C
charge: 0.125718 0.068902 0.941085 -0.530189 -0.532494 0.108959 0.109782 -0.261257 0.114715 -0.165446 0.078031 -0.057805
polarizability: 2.03646408e+02 3.02663916e+00 1.22122927e+02 2.48965385e-01 3.07140440e-01 7.07126124e+01
1716.lowfreq: -11.6261 -8.1102 -5.1019 0.0009 0.0016 0.0021 3.4405 42.8186 98.0975
frequency: -10.1009 42.8046 98.0971 118.2947 142.3474 147.2235 163.3588 185.1338 204.0055 236.3772 293.4446 323.4698 341.2961 390.0108 408.9341 427.4326 451.3642 576.7300 601.2846 641.9608 756.0533 757.8010 803.1228 895.7934 925.6520 955.7400 976.5196 1013.8862 1130.3778 1170.1177 1221.6355 1263.1838 1306.6436 1353.7816 1406.7491 1414.1023 1457.7178 1472.1742 3038.5647 3171.9572 3184.5175 3199.2419
redmass: 7.1555 10.6580 6.4690 6.6954 1.1011 18.5315 16.9837 11.0963 5.5021 4.3830 9.5125 10.4065 9.9675 11.8530 8.9366 3.8332 12.8990 9.2111 11.6429 9.6659 11.3762 8.4063 12.7395 3.0804 1.4514 12.0900 1.3095 1.8924 9.2821 2.8419 10.7234 9.7629 1.1624 1.8983 1.0547 1.0546 6.5106 7.6413 1.0248 1.0944 1.1074 1.1078
irintensity: 6.6138 0.1448 8.1890 0.0838 0.0500 0.0748 0.1044 0.6609 3.2662 0.1188 20.1069 4.6797 14.5246 72.1387 5.8663 5.4339 1.3082 59.9102 2.7420 24.8426 41.3813 2.2224 53.6191 34.8292 8.1116 46.3149 51.7837 58.5849 23.6726 173.7606 25.7591 6.7615 13.5905 239.4582 18.4058 13.7900 139.8792 15.3641 0.2747 2.6718 0.5370 0.2562
temp: 298.150 k
press: 1.00000 atm
elementType: 35 17 16 8 8 7 7 6 6 6 6 6 1 1 1 1
symmnumber: 1
zpe: 231291.4 jmol-1
zpe.correction: 0.088094 hartree
zpe.thermalcorrener: 0.100212 hartree
zpe.thermalcorrenthalpy: 0.101156 hartree
zpe.thermalcorrgfe: 0.047932 hartree
zpe.sumelectzpe: -1323.367766 hartree
zpe.sumelectthermal: -1323.355648 hartree
zpe.sumelectthermalent: -1323.354704 hartree
zpe.sumelectthermalfe: -1323.407928 hartree
dipole: 4.8704 3.0903 -0.4100
dipole: 5.7826
quadrupole: -103.8334 -91.9996 -99.7598
quadrupole: -21.0639 1.4155 -0.6579
quadrupole: -5.3024 6.5313 -1.2289 -21.0639 1.4155 -0.6579
hfenergy: -1323.4558599 hartree
pointgroup: C01 [X(C5H4Br1Cl1N2O2S1)]
dipole: -1.9608482 -1.102428 -0.3400058 debye
dipolederiv: -0.7832673 0.1303356 0.0432497 0.1310397 0.0399803 -0.0073528 0.0415492 -0.0070397 0.0606252 -0.304744 -0.3199584 -0.0550838 -0.4439675 -0.5835476 -0.0985952 -0.0792591 -0.1015899 -0.0380352 1.8266521 0.0516503 -0.0029274 -0.1440671 1.2262781 0.0048297 -0.0640038 0.0015553 1.2592305 -0.7139894 -0.0225095 0.0255817 -0.0334021 -0.5435112 0.0221664 0.173326 0.1192515 -0.5902241 -0.7219382 -0.0066817 -0.018934 0.0663731 -0.4941089 0.0279977 -0.1527252 -0.0668431 -0.6425527 -1.2699658 -0.3442163 -0.043306 -0.2504417 -0.5266505 -0.0865984 -0.0208401 -0.0789327 -0.0890723 -0.9349237 0.0379209 0.0228471 0.3980994 -0.4490392 -0.0746812 0.0913879 -0.0744281 -0.1061278 1.0631951 -0.0597787 -0.0358344 -0.0946938 0.3483634 0.1021574 -0.0380011 0.1043008 -0.1541861 -0.1603488 -0.0279089 -0.0068604 0.0439119 -0.2271148 -0.0323249 0.0111303 -0.0320744 -0.1107947 0.4909047 0.6726855 0.1215591 0.6628415 1.1814427 0.1937081 0.1208387 0.1932281 0.1294603 0.1272401 0.2242898 0.0407745 -0.0218355 0.4357272 0.0748493 -0.0018904 0.0699558 0.0602412 1.1589896 -0.3626478 -0.0966418 -0.3911979 -0.5636353 -0.0916665 -0.1016071 -0.0923969 -0.05735 0.1005226 0.0026664 -0.0522733 0.0150728 0.0237011 -0.0275172 -0.0731244 -0.0031803 0.0064941 -0.0132307 0.0123143 0.0017946 0.0302476 0.0748151 -0.0139622 0.0085714 -0.0143254 0.1141611 0.1033896 -0.025929 0.0464837 -0.0290473 0.0099944 0.0241713 0.069413 -0.0006262 0.0309659 0.0315142 0.0377675 0.0095706 0.0610671 0.0473055 -0.0171815 0.0152347 -0.0168547 0.1271647 unknown
polarizability: 203.695579|0.6804745|120.2414543|-2.8240466|9.3605177|72.5449136 unknown
InChI: InChI=1S/C5H4BrClN2O2S/c1-12(10,11)5-8-2-3(6)4(7)9-5/h2H,1H3
charge 0 multiplicity 1
16 atoms
Br -4.087822 0.695643 0.112021
Cl -2.476886 -2.271778 -0.493084
S  2.459358 0.130912 -0.115455
O  2.997049 1.086844 -1.319581
O  2.989434 0.321511 1.413934
N  -0.187627 -0.86131 -0.271646
N  0.029781 1.5072 0.175357
C  0.507822 0.275626 -0.070788
C  2.722348 -1.695653 -0.625329
C  -1.533558 -0.764423 -0.224758
C  -1.330674 1.604984 0.224664
C  -2.172996 0.478872 0.02778
H  2.271626 -1.823848 -1.617669
H  3.816158 -1.804162 -0.641062
H  2.245282 -2.320522 0.139745
H  -1.753195 2.593703 0.425172
