program: Gaussian 09
title: 000240574
version: EM64L-G09RevD.01
frameworkgroup: C1[X(C12H12BrN3S)]
method: RPBEPBE
basis: SDD
operation: Freq
keyword: #p
keyword: freq=noraman
keyword: PBEPBE/SDD
title: #p freq=noraman PBEPBE/SDD
converged: YES YES NO NO
title: Mulliken charges:
elementType: Br S N N N C C C C C C C C C C C C H H H H H H H H H H H H
charge: 0.011386 0.285503 -0.451218 -0.034270 0.025158 0.278416 0.266658 -0.320523 -0.386679 0.379515 -0.843035 -0.244471 -0.252718 -0.354286 -0.378824 -0.241442 -0.837084 0.321332 0.308682 0.230401 0.246621 0.236548 0.235684 0.226187 0.229104 0.263912 0.274577 0.275526 0.249340
chargesum: 0.00000
title: Mulliken charges with hydrogens summed into heavy atoms:
elementType: Br S N N N C C C C C C C C C C C C
charge: 0.011386 0.285503 -0.129887 -0.034270 0.025158 0.278416 0.266658 -0.011841 -0.156278 0.379515 -0.124182 -0.018284 -0.023614 -0.354286 -0.378824 0.022470 -0.037641
polarizability: 2.67465797e+02 -3.10187722e+00 2.60614371e+02 5.23360253e-02 -2.70351820e-01 7.54693701e+01
1716.lowfreq: -5.7105 -5.1577 0.0016 0.0016 0.0021 4.9035 17.7873 43.1986 61.9390
frequency: 17.7326 43.1728 61.9372 70.0364 95.9957 124.4474 160.6307 166.1811 171.7077 190.0367 198.7376 205.6667 260.5470 270.6059 306.5295 319.8984 396.8180 416.0202 428.3915 444.9466 466.1967 532.8523 536.1515 577.2530 635.4597 644.3142 666.6417 678.6349 716.5525 730.3724 760.0422 768.1850 781.3074 835.3558 878.8175 917.2317 931.5597 952.2823 959.6221 978.1051 981.5186 994.4224 994.7692 1042.2274 1043.9083 1109.5061 1166.0309 1172.8706 1186.7219 1192.5186 1254.5344 1284.1247 1300.4991 1328.4468 1348.1608 1367.4417 1396.9587 1424.4956 1431.4924 1439.5989 1447.3896 1457.5885 1477.3210 1481.7550 1490.8210 1515.3790 1563.2366 1601.3863 1621.3819 2953.6047 3018.6004 3021.8548 3090.2042 3123.1787 3136.1751 3142.2932 3146.8700 3156.8556 3161.8684 3207.4456 3486.0361
redmass: 3.8204 4.1002 5.7811 6.6985 5.4774 6.6441 1.9233 1.5036 4.1951 1.0829 5.5067 4.6582 8.4413 5.4156 4.8049 5.8974 5.2720 4.0754 3.6904 2.9451 9.0309 5.7602 3.0177 7.7556 2.6222 6.7126 7.3812 2.1039 9.1747 2.5356 5.0270 1.5524 4.9490 5.1642 1.3057 1.4031 7.1411 1.3691 4.6817 1.1806 1.6502 1.4184 1.3053 1.5330 2.0925 1.8963 3.6128 1.1109 4.2304 2.2499 2.9537 3.6252 1.9679 1.5971 1.3234 4.1617 1.2739 3.8757 2.8638 1.0531 2.0885 1.0809 1.8029 1.0468 1.7674 5.3810 3.2241 3.8771 4.9670 1.0403 1.0281 1.0978 1.0946 1.0873 1.0904 1.1037 1.1061 1.0937 1.0989 1.0934 1.0748
irintensity: 0.1302 1.6004 0.0002 0.0291 1.5084 0.9497 0.7798 0.3507 2.2129 1.0845 1.7975 0.0105 1.1038 4.3084 0.9427 2.4784 4.7112 3.1415 4.7372 8.1804 15.7082 7.4401 4.5115 18.4217 9.2981 1.6262 3.0087 29.8989 2.4183 0.7797 0.5390 113.3610 0.7805 1.1886 1.9066 10.6067 57.1188 2.9616 7.0962 7.3555 6.7017 3.2206 0.2532 6.2002 18.2108 17.1394 211.6718 1.4184 11.8096 13.2073 21.8802 1.2884 28.8108 165.7303 69.8374 8.5553 15.0370 78.9924 40.6459 15.2927 47.0508 26.0681 10.7000 15.1205 135.1045 428.2960 520.0803 168.9688 23.3947 24.4057 16.0869 20.7145 19.0767 8.9942 19.3999 14.5299 12.0081 9.2485 29.7739 12.8307 55.7421
temp: 298.150 k
press: 1.00000 atm
elementType: 35 16 7 7 7 6 6 6 6 6 6 6 6 6 6 6 6 1 1 1 1 1 1 1 1 1 1 1 1
symmnumber: 1
zpe: 568575.9 jmol-1
zpe.correction: 0.216559 hartree
zpe.thermalcorrener: 0.233195 hartree
zpe.thermalcorrenthalpy: 0.234139 hartree
zpe.thermalcorrgfe: 0.169964 hartree
zpe.sumelectzpe: -1039.038429 hartree
zpe.sumelectthermal: -1039.021794 hartree
zpe.sumelectthermalent: -1039.020849 hartree
zpe.sumelectthermalfe: -1039.085024 hartree
dipole: 3.9383 -0.8947 0.0074
dipole: 4.0387
quadrupole: -120.3451 -102.8252 -121.8227
quadrupole: 2.7264 0.0844 -0.0872
quadrupole: -5.3474 12.1725 -6.8250 2.7264 0.0844 -0.0872
hfenergy: -1039.2549882 hartree
pointgroup: C01 [X(C12H12Br1N3S1)]
dipole: -1.5541174 -0.2991275 0.1412603 debye
polarizability: 267.0981706|0.9002836|252.5111254|-10.0482232|-37.5499919|83.9402424 unknown
InChI: InChI=1S/C12H12BrN3S/c1-8-5-3-4-6-10(8)15-11-9(13)7-14-12(16-11)17-2/h3-7,15H,1-2H3
charge 0 multiplicity 1
29 atoms
Br 1.367906 -3.53656 0.788907
S  3.320424 2.476948 -0.606649
N  -0.422249 -0.937914 0.323781
N  1.360847 0.613095 -0.102867
N  3.689552 -0.115325 -0.071517
C  -1.582666 -0.119514 0.210376
C  -2.845611 -0.771053 0.401173
C  -1.529692 1.269762 -0.073494
C  -4.021533 0.005274 0.29771
C  0.920964 -0.652939 0.192041
C  -2.931152 -2.25787 0.706995
C  -2.723845 2.014084 -0.16904
C  -3.976277 1.389492 0.015133
C  1.900046 -1.692875 0.363689
C  2.699857 0.814678 -0.218867
C  3.258118 -1.379475 0.223683
C  1.71505 3.444282 -0.731447
H  -0.609967 -1.921285 0.541609
H  -0.556335 1.737997 -0.214419
H  -4.990145 -0.487905 0.442296
H  -3.982119 -2.56913 0.821213
H  -2.496531 -2.879229 -0.102325
H  -2.412481 -2.523929 1.650597
H  -2.670133 3.086266 -0.38862
H  -4.903946 1.966573 -0.058809
H  4.030018 -2.144959 0.347981
H  1.18175 3.413422 0.229471
H  1.087591 3.028088 -1.532566
H  2.015361 4.475904 -0.972937
