program: Gaussian 09
title: 000240545
version: EM64L-G09RevD.01
frameworkgroup: C1[X(C6H8O4)]
method: RPBEPBE
basis: SDD
operation: Freq
keyword: #p
keyword: freq=noraman
keyword: PBEPBE/SDD
title: #p freq=noraman PBEPBE/SDD
converged: YES YES NO NO
title: Mulliken charges:
elementType: O O O O C C C C C C H H H H H H H H
charge: -0.409404 -0.410080 -0.243986 -0.244521 0.303075 0.082696 -0.771243 -0.772333 0.108741 0.109723 0.266250 0.250352 0.226339 0.226864 0.250147 0.266237 0.380525 0.380617
chargesum: 0.00000
title: Mulliken charges with hydrogens summed into heavy atoms:
elementType: O O O O C C C C C C
charge: -0.028879 -0.029463 -0.243986 -0.244521 0.303075 0.082696 -0.028301 -0.029084 0.108741 0.109723
polarizability: 1.04086562e+02 1.58663230e-01 8.68635228e+01 -4.96956124e-02 5.25900734e+00 5.12840741e+01
1716.lowfreq: -12.4216 -9.1623 -7.3590 -0.0010 -0.0005 -0.0002 26.7591 66.7032 86.4277
frequency: 26.5577 66.6438 86.4250 109.3497 144.3286 193.1708 202.2680 235.7938 370.1937 384.7258 402.4440 414.6738 481.2203 486.4281 567.1730 607.5071 622.2192 664.5584 709.9315 767.6324 899.1443 949.8185 975.1108 984.6271 1042.1909 1078.6264 1111.4868 1142.1512 1258.0714 1300.8808 1309.4383 1391.7246 1398.8793 1445.3442 1455.7623 1461.3498 1466.5947 1622.3043 1627.8321 1643.6800 2979.4451 2983.9859 3054.4652 3057.4096 3128.2652 3129.7175 3520.8878 3521.3645
redmass: 6.8571 1.2239 3.9641 3.3150 1.2990 5.0938 4.0147 3.3959 3.2067 3.6130 3.8837 10.1192 2.1379 3.1271 1.2224 1.4872 4.6434 4.0028 6.0228 9.3202 3.6867 1.2871 1.7606 3.4906 2.1090 1.7868 2.0627 1.7788 3.7144 2.5877 3.5960 1.1784 1.1782 1.0649 1.0583 1.1333 1.0772 6.1603 8.2775 8.4849 1.0406 1.0411 1.0945 1.0941 1.0974 1.0976 1.0640 1.0641
irintensity: 3.6840 2.6903 0.1923 0.0298 0.0218 5.7709 0.0278 1.2365 13.0930 6.0031 0.4938 2.2582 12.2072 6.4615 64.5933 243.1317 13.6834 39.0331 4.7184 4.7308 43.0792 0.4700 34.9843 64.7898 362.2393 36.7783 71.7015 91.1758 0.8929 64.7243 31.8599 41.0245 38.1286 29.2255 20.1307 19.1042 18.7327 116.6716 480.3512 63.0642 0.4318 19.1557 12.4135 19.5367 9.2344 4.2375 32.5042 41.4273
temp: 298.150 k
press: 1.00000 atm
elementType: 8 8 8 8 6 6 6 6 6 6 1 1 1 1 1 1 1 1
symmnumber: 1
zpe: 349810.8 jmol-1
zpe.correction: 0.133236 hartree
zpe.thermalcorrener: 0.144431 hartree
zpe.thermalcorrenthalpy: 0.145376 hartree
zpe.thermalcorrgfe: 0.095348 hartree
zpe.sumelectzpe: -533.567259 hartree
zpe.sumelectthermal: -533.556063 hartree
zpe.sumelectthermalent: -533.555119 hartree
zpe.sumelectthermalfe: -533.605146 hartree
dipole: -0.9254 -0.0154 0.0296
dipole: 0.9260
quadrupole: -44.5610 -62.9670 -60.8987
quadrupole: 0.2163 0.0869 -7.6570
quadrupole: 11.5812 -6.8248 -4.7565 0.2163 0.0869 -7.6570
hfenergy: -533.7004946 hartree
pointgroup: C01 [X(C6H8O4)]
dipole: 0.1902798 -0.3004957 0.0789313 debye
dipolederiv: -0.4676839 0.3216805 0.0838658 0.3802627 -1.0200568 -0.3097065 0.1101041 -0.3768026 -0.4983947 -0.5017783 0.3034258 -0.3406852 0.2467143 -0.6767955 0.3178993 -0.3708773 0.3824832 -0.811114 -0.7946521 -0.1046525 0.3395699 -0.1610421 -0.6752023 0.0829321 0.2945356 -0.0472252 -0.4996927 -0.8681041 -0.1446616 0.2134499 -0.1298374 -0.4991543 0.2503412 0.0711963 0.2629316 -0.6039992 0.4801753 -0.2632597 0.0302157 -0.2450477 0.725823 -0.1836373 0.1281986 -0.1246633 0.0202282 -0.6641891 0.1577101 -0.0375074 0.16459 -0.7852926 0.149104 -0.0008535 0.1716146 -0.1536139 -0.0507853 -0.0799996 0.0135968 -0.1098158 -0.2408191 0.1028171 -0.0238463 0.1743258 -0.0068967 -0.3115699 0.0434923 0.0230594 0.0788613 -0.052201 0.0003703 0.0568502 -0.0682796 0.0626993 0.9594727 0.0942635 -0.5699338 -0.0340274 1.7296126 0.1603038 -0.580272 0.2623539 0.614864 1.5852261 -0.2149914 0.1348306 -0.0781107 0.6903152 -0.633674 0.1738307 -0.715984 1.0339901 -0.0393722 -0.0530681 -0.0669017 0.000209 0.1038752 0.0045407 -0.0552908 -0.0223827 0.0856671 0.1179522 -0.0292242 -0.010881 0.0115581 0.0654107 0.0140489 -0.0140952 0.0314592 -0.0681164 0.0118136 0.0881177 0.071298 0.0729435 -0.0447994 -0.0416109 0.0599566 -0.1113538 0.0827376 0.0506627 0.0335605 -0.0208966 0.0276412 0.014273 0.1143412 -0.0897098 0.1341671 -0.0135413 0.0589838 0.0504657 0.0170647 0.0146406 0.0829574 -0.0679729 0.0447356 -0.0709539 -0.0267006 0.064195 -0.0488192 -0.0170854 -0.1008888 -0.0178514 -0.047561 -0.0176454 -0.0160711 0.1036161 0.2275468 -0.1092452 0.0817633 -0.0836623 0.2661918 0.0423852 0.0843682 0.1171917 0.3290358 0.1421068 -0.0447946 0.0551767 -0.0549882 0.3337136 0.045079 0.1288144 0.0171891 0.3492313 unknown
polarizability: 91.5217304|-8.3183001|96.1456937|-2.4856448|-12.5740743|54.5667352 unknown
InChI: InChI=1S/C6H8O4/c1-3(2)4(5(7)8)6(9)10/h7,9H,1-2H3
charge 0 multiplicity 1
18 atoms
O  0.003272 2.2548 0.260235
O  -1.956684 0.748975 -1.14517
O  1.774961 1.383708 -0.954305
O  -2.267393 -0.782605 0.566707
C  0.723148 -1.262799 0.164294
C  0.010217 -0.10823 -0.094332
C  0.062891 -2.602625 0.413407
C  2.235561 -1.302518 0.226717
C  0.696166 1.195313 -0.341454
C  -1.482241 -0.103859 -0.139037
H  -0.968416 -2.665442 0.039351
H  0.018139 -2.794619 1.503794
H  0.676271 -3.407787 -0.030842
H  2.556073 -1.998044 1.02407
H  2.633897 -1.700816 -0.72749
H  2.700267 -0.318355 0.378034
H  0.463299 3.108833 0.037367
H  -2.951427 0.760968 -1.115245
