program: Gaussian 09
title: 000020284
version: EM64L-G09RevD.01
frameworkgroup: C1[X(C11H22)]
method: RPBEPBE
basis: SDD
operation: Freq
keyword: #p
keyword: freq=noraman
keyword: PBEPBE/SDD
title: #p freq=noraman PBEPBE/SDD
converged: YES YES NO NO
title: Mulliken charges:
elementType: C C C C C C C C C C C H H H H H H H H H H H H H H H H H H H H H H
charge: 0.039016 -0.451090 -0.450362 -0.441456 -0.403481 -0.402101 -0.382530 -0.383695 -0.352908 -0.358131 -0.697101 0.185695 0.185257 0.206981 0.195668 0.189304 0.194398 0.188060 0.194886 0.189118 0.190793 0.194420 0.196947 0.186910 0.201231 0.186173 0.185912 0.188696 0.194847 0.194468 0.209521 0.214716 0.209837
chargesum: 0.00000
title: Mulliken charges with hydrogens summed into heavy atoms:
elementType: C C C C C C C C C C C
charge: 0.224711 -0.058852 -0.065390 -0.058997 -0.019477 -0.016888 0.001327 0.003709 0.021700 0.031185 -0.063027
polarizability: 1.43664302e+02 8.63760773e-02 1.07937967e+02 -5.38969544e-01 -3.73762118e-01 9.79690445e+01
1716.lowfreq: -6.5732 -0.0007 -0.0004 -0.0002 17.9361 31.3548 47.0605 52.1098 75.0552
frequency: 45.9360 51.0312 74.4020 109.6401 123.5565 158.8095 200.3868 222.5769 232.2122 252.1730 318.6890 347.1341 410.8582 437.3288 450.2452 476.3245 549.9101 722.8645 743.4214 775.5373 784.0073 821.4816 842.9675 874.3679 889.4034 893.2158 912.0963 950.9804 959.7338 1006.7097 1031.6713 1049.9675 1054.9402 1058.7320 1070.1085 1082.6621 1104.6936 1113.6213 1119.5165 1161.7313 1186.0322 1199.3467 1234.3998 1244.9908 1254.1706 1258.2701 1270.5388 1282.0086 1288.6731 1291.2736 1310.5125 1314.3676 1333.7975 1336.9625 1339.4026 1341.3689 1350.8473 1355.9057 1360.7964 1389.5140 1454.9728 1460.8678 1462.2661 1463.0778 1464.1314 1468.5324 1470.9494 1476.1380 1477.2223 1480.5106 1488.0646 2926.4724 2942.0339 2949.1536 2950.1840 2955.1193 2957.5926 2961.8657 2962.3576 2964.1281 2967.0962 2971.2782 2985.1237 2993.5045 3012.0945 3016.5689 3022.0678 3023.4970 3026.4766 3035.6384 3038.1233 3067.6559 3070.0715
redmass: 3.0184 1.6783 3.2797 2.5059 1.7890 2.5021 2.6897 1.7811 1.1221 3.5678 1.7735 2.5708 2.4702 2.8035 1.9892 2.9067 1.8243 1.0784 1.2259 1.9045 1.5808 1.2947 2.1225 1.5826 1.5763 1.7813 1.8833 1.2772 2.2545 3.5830 1.4942 1.8040 1.5070 1.6201 1.6698 1.7122 2.2908 1.7402 2.6272 2.2896 1.5912 1.5732 1.3262 1.3309 1.2085 1.2808 1.2780 1.1264 1.1532 1.1580 1.3303 1.2502 1.3990 1.4392 1.5102 1.5971 1.5775 1.5480 1.5456 1.2177 1.0828 1.0882 1.0878 1.0861 1.0727 1.0796 1.0774 1.0920 1.0426 1.0768 1.0877 1.0806 1.0594 1.0623 1.0592 1.0629 1.0607 1.0600 1.0612 1.0669 1.0590 1.0366 1.0957 1.1005 1.0997 1.1003 1.0976 1.0980 1.0995 1.1037 1.1035 1.1006 1.0993
irintensity: 0.0059 0.0032 0.0142 0.0107 0.0018 0.0276 0.0463 0.0879 0.0007 0.0648 0.0481 0.0816 0.1338 0.0841 0.7060 0.3702 0.5496 10.3693 0.5812 0.0615 0.0573 1.1166 5.9280 2.0167 16.5997 2.6220 0.4021 2.3163 2.7541 1.7263 2.0024 1.3765 0.2140 0.1275 4.0611 2.3919 0.8251 6.6496 0.9448 0.5254 0.2544 0.1126 2.7093 2.3258 1.1332 1.7956 0.7097 0.3558 0.9593 0.7618 0.3971 0.4209 0.1822 0.8201 0.5725 1.1371 0.5765 0.3250 1.4508 11.6255 0.5897 3.0208 5.6710 6.2196 2.3505 13.4222 6.3971 3.0684 11.9711 3.6382 19.4712 6.5097 5.6309 22.0976 1.4891 25.4731 76.5475 29.5275 30.7426 35.4665 111.9090 36.0963 4.4703 2.2158 37.5659 43.0107 93.8131 27.2559 2.7347 83.1221 188.7244 94.3812 54.7447
temp: 298.150 k
press: 1.00000 atm
elementType: 6 6 6 6 6 6 6 6 6 6 6 1 1 1 1 1 1 1 1 1 1 1 1 1 1 1 1 1 1 1 1 1 1
symmnumber: 1
zpe: 803852.6 jmol-1
zpe.correction: 0.306171 hartree
zpe.thermalcorrener: 0.319028 hartree
zpe.thermalcorrenthalpy: 0.319972 hartree
zpe.thermalcorrgfe: 0.266528 hartree
zpe.sumelectzpe: -431.452772 hartree
zpe.sumelectthermal: -431.439916 hartree
zpe.sumelectthermalent: -431.438972 hartree
zpe.sumelectthermalfe: -431.492416 hartree
dipole: 0.0446 0.0268 -0.0606
dipole: 0.0799
quadrupole: -73.7648 -72.4872 -71.2138
quadrupole: -0.1546 0.2398 0.4286
quadrupole: -1.2762 0.0014 1.2748 -0.1546 0.2398 0.4286
hfenergy: -431.7589436 hartree
pointgroup: C01 [X(C11H22)]
dipole: 0.0174683 0.0102866 -0.0240027 debye
polarizability: 143.6605522|0.3619372|107.9263912|-0.5465332|-0.5426617|97.9843693 unknown
InChI: InChI=1S/C11H22/c1-2-3-5-8-11-9-6-4-7-10-11/h11H,2-10H2,1H3
charge 0 multiplicity 1
33 atoms
C  0.994033 -0.272286 -0.226893
C  1.415043 1.11452 0.327938
C  2.065482 -1.334725 0.136856
C  -0.408416 -0.711548 0.265572
C  2.830264 1.526657 -0.143877
C  3.481175 -0.930253 -0.33719
C  3.884126 0.455011 0.221868
C  -1.577112 0.173082 -0.22583
C  -2.962377 -0.369975 0.191493
C  -4.137741 0.50602 -0.298498
C  -5.517984 -0.048911 0.114796
H  0.958505 -0.19532 -1.337683
H  1.397031 1.071385 1.438596
H  0.682126 1.887818 0.026784
H  1.782799 -2.314098 -0.298969
H  2.074745 -1.467832 1.24014
H  -0.409118 -0.737897 1.376605
H  -0.590053 -1.75531 -0.068701
H  3.10778 2.504263 0.297037
H  2.820061 1.663611 -1.24548
H  3.497781 -0.891921 -1.446499
H  4.220035 -1.697195 -0.032201
H  4.880811 0.749876 -0.160924
H  3.969625 0.39065 1.326797
H  -1.461775 1.204379 0.164976
H  -1.534118 0.252973 -1.332938
H  -3.086428 -1.400752 -0.202675
H  -3.005936 -0.454959 1.297806
H  -4.016333 1.534086 0.100152
H  -4.088703 0.594507 -1.403269
H  -5.67555 -1.06411 -0.296515
H  -6.340427 0.594404 -0.24881
H  -5.603651 -0.117847 1.215837
