program: Gaussian 09
title: 000240536
version: EM64L-G09RevD.01
frameworkgroup: C1[X(C13H22O4)]
method: RPBEPBE
basis: SDD
operation: Freq
keyword: #pfreq=noraman
keyword: PBEPBE/SDD
title: #p freq=noraman PBEPBE/SDD
converged: YES YES NO NO
title: Mulliken charges:
elementType: O O O O C C C C C C C C C C C C C H H H H H H H H H H H H H H H H H H H H H H
charge: -0.272194 -0.275338 -0.241821 -0.221933 0.123899 -0.188347 -0.408249 0.207770 0.214691 -0.756403 -0.049847 -0.727837 -0.621479 -0.265403 -0.258247 -0.655360 -0.669036 0.225667 0.214988 0.217238 0.226624 0.256194 0.223356 0.275411 0.206348 0.230326 0.259965 0.215819 0.210148 0.233899 0.217744 0.220370 0.238474 0.254867 0.234203 0.208849 0.223213 0.253032 0.218399
chargesum: 0.00000
title: Mulliken charges with hydrogens summed into heavy atoms:
elementType: O O O O C C C C C C C C C C C C C
charge: -0.272194 -0.275338 -0.241821 -0.221933 0.123899 0.037320 0.023976 0.207770 0.214691 -0.050229 0.225564 -0.031197 -0.195512 0.186240 0.200597 0.042559 0.025608
polarizability: 1.65530395e+02 -4.57718853e+00 1.50872982e+02 4.62682753e+00 -4.19316788e+00 1.40872553e+02
1716.lowfreq: -12.9956 -8.9659 -0.0001 0.0004 0.0008 4.6335 24.2464 34.2431 51.3281
frequency: 22.2145 34.1707 51.3000 55.5329 68.4291 77.0366 90.1985 104.7223 117.5370 131.1059 144.8204 171.4249 184.9566 199.3488 205.0778 211.6927 221.8324 252.6486 262.3105 290.7352 308.8552 315.7637 325.3847 351.7155 384.2568 403.0232 432.0596 438.4222 491.7587 574.5464 657.5846 671.2516 708.6029 716.3411 739.6537 765.3892 806.3055 812.5962 815.8898 827.6683 859.1225 922.4905 940.6544 946.0397 962.0821 983.0089 1008.8962 1014.3302 1024.2748 1056.6217 1074.8258 1086.7783 1088.4599 1096.2446 1097.3134 1106.1192 1154.1692 1155.3160 1163.3662 1194.0224 1206.0626 1274.5116 1276.8569 1276.9663 1283.1996 1306.1482 1317.6601 1341.8080 1353.3344 1354.5536 1384.0581 1387.4787 1391.0824 1392.7175 1429.7367 1455.6579 1456.2706 1458.1967 1459.8051 1462.5233 1474.5653 1475.5167 1481.4560 1484.7099 1490.0329 1494.0207 1620.9317 1624.3327 1651.6969 2990.2201 2991.8533 2992.0111 2995.8039 2996.2276 3005.4549 3029.6803 3030.3675 3050.0278 3078.1238 3080.0315 3081.6418 3086.0676 3092.6748 3092.8499 3096.0558 3104.2353 3118.3849 3118.6859 3122.5980 3125.5837 3189.5287
redmass: 3.8725 2.8826 2.8370 3.6914 3.4625 2.9242 4.3857 4.8808 1.7996 2.7793 2.1318 3.0901 1.9527 1.7206 1.7610 1.1431 1.5483 1.7998 2.9343 2.2517 2.5296 2.9286 3.2682 3.6800 3.6785 3.4008 3.4264 3.6420 4.6274 2.7177 5.5200 2.5217 3.7327 2.8317 2.6508 1.5178 1.8764 1.4705 1.7033 2.7392 2.1881 2.1465 1.5021 1.8397 3.1658 1.2698 2.6664 2.7653 1.1678 2.0480 2.3014 4.0819 2.5792 2.1205 2.3375 2.8050 1.7476 1.7061 4.2402 2.5054 2.8731 1.1831 1.1688 1.1196 1.2179 1.2499 1.3701 1.2729 1.3103 1.2850 1.1931 1.2162 1.2215 1.2266 1.1959 1.0943 1.0803 1.0564 1.0810 1.0445 1.0431 1.0442 1.0537 1.0508 1.0546 1.0526 9.6049 9.7935 4.6613 1.0436 1.0373 1.0360 1.0519 1.0379 1.0830 1.0590 1.0590 1.1017 1.0981 1.0614 1.0982 1.0977 1.0972 1.1030 1.1044 1.0997 1.1034 1.1017 1.1048 1.0927 1.1134
irintensity: 0.6893 0.1323 1.4726 1.5538 0.3051 0.6178 0.6233 0.2642 0.0683 0.7281 1.0943 0.6586 2.9722 0.1244 1.2391 0.3523 0.5801 1.7649 0.9605 1.7227 5.4438 13.1365 6.7452 4.1555 3.5678 1.4293 1.6440 6.9226 5.3939 0.2793 13.2807 9.9413 3.1063 9.2842 13.4803 9.4639 4.8892 3.8039 4.1846 6.0494 4.7018 33.4787 43.0149 43.0767 2.6779 9.1843 61.4242 60.5434 26.6501 55.3778 229.2303 6.1223 126.0251 7.3044 18.8785 28.8825 14.2375 18.8966 132.5535 11.3498 126.5238 3.7218 2.5297 4.1347 10.8136 1.6610 10.4607 3.5725 1.2980 0.8686 23.2232 2.0524 40.4896 26.4742 8.6738 7.7934 17.8679 11.0861 6.5502 15.8854 5.8373 6.0541 16.8125 19.2590 8.9230 2.1950 152.3317 152.5467 13.0481 18.2302 49.0356 13.6368 41.5919 9.4672 13.2305 41.8834 19.5934 14.9407 33.8923 14.6330 40.1413 31.7749 39.0960 1.0612 0.7290 13.6338 6.3038 41.6008 27.8146 3.6059 26.5339
temp: 298.150 k
press: 1.00000 atm
elementType: 8 8 8 8 6 6 6 6 6 6 6 6 6 6 6 6 6 1 1 1 1 1 1 1 1 1 1 1 1 1 1 1 1 1 1 1 1 1 1
symmnumber: 1
zpe: 860786.7 jmol-1
zpe.correction: 0.327856 hartree
zpe.thermalcorrener: 0.348928 hartree
zpe.thermalcorrenthalpy: 0.349873 hartree
zpe.thermalcorrgfe: 0.277134 hartree
zpe.sumelectzpe: -808.099679 hartree
zpe.sumelectthermal: -808.078607 hartree
zpe.sumelectthermalent: -808.077663 hartree
zpe.sumelectthermalfe: -808.150402 hartree
dipole: -1.1829 -1.5361 1.5542
dipole: 2.4848
quadrupole: -89.1744 -104.2250 -103.5836
quadrupole: -2.5030 2.4027 1.4350
quadrupole: 9.8199 -5.2307 -4.5892 -2.5030 2.4027 1.4350
hfenergy: -808.4275354 hartree
pointgroup: C01 [X(C13H22O4)]
dipole: 0.5011823 -0.5853954 -0.6015023 debye
polarizability: 164.6954071|6.389239|152.4696036|2.7957777|3.7431201|140.1109198 unknown
InChI: InChI=1S/C13H22O4/c1-6-10(5)13(7-2,11(14)16-8-3)12(15)17-9-4/h6,10H,1,7-9H2,2-5H3
charge 0 multiplicity 1
39 atoms
O  -2.082486 -1.016382 -0.438049
O  2.047019 -0.123626 -0.452622
O  -2.346639 1.125808 0.406675
O  0.504437 -0.816131 1.148772
C  -0.248258 0.529987 -0.81411
C  0.142817 2.072653 -0.747803
C  -0.161138 0.042954 -2.309997
C  -1.651576 0.284268 -0.208586
C  0.761404 -0.226613 0.076023
C  -0.821652 2.974971 -1.562983
C  0.271538 2.591158 0.677505
C  -0.009126 -1.472437 -2.559561
C  1.426976 3.058917 1.211712
C  -3.366964 -1.42291 0.218902
C  3.149522 -0.733604 0.356575
C  -3.106631 -1.867487 1.660357
C  3.298724 -2.225009 0.044367
H  1.145535 2.121386 -1.215234
H  -1.062308 0.408195 -2.837233
H  0.707016 0.562121 -2.75826
H  -0.449964 4.014774 -1.539089
H  -1.836142 2.964688 -1.13145
H  -0.881321 2.66343 -2.621079
H  -0.653869 2.5937 1.268421
H  0.057787 -1.660546 -3.647414
H  0.914544 -1.862022 -2.096641
H  -0.865668 -2.035308 -2.158258
H  1.468587 3.448188 2.235521
H  2.364695 3.068647 0.639981
H  -4.068057 -0.571034 0.175112
H  -3.728503 -2.248727 -0.414726
H  4.037601 -0.155115 0.055432
H  2.927626 -0.565658 1.424873
H  -2.745717 -1.024114 2.271163
H  -2.34973 -2.669005 1.692161
H  -4.04442 -2.248269 2.106408
H  3.466361 -2.389484 -1.034314
H  2.400125 -2.781536 0.358514
H  4.167256 -2.633432 0.593939
