program: Gaussian 09
title: 000240541
version: EM64L-G09RevD.01
frameworkgroup: C1[X(C13H22O4)]
method: RPBEPBE
basis: SDD
operation: Freq
keyword: #pfreq=noraman
keyword: PBEPBE/SDD
title: #p freq=noraman PBEPBE/SDD
converged: YES YES NO NO
title: Mulliken charges:
elementType: O O O O C C C C C C C C C C C C C H H H H H H H H H H H H H H H H H H H H H H
charge: -0.267312 -0.265975 -0.232405 -0.224303 -0.020137 -0.459794 -0.441068 -0.406598 -0.411324 -0.385380 -0.324715 0.224283 0.224980 -0.262836 -0.259624 -0.664778 -0.665553 0.221048 0.249325 0.203066 0.188636 0.229178 0.185304 0.200742 0.199313 0.190839 0.197359 0.195366 0.272993 0.236507 0.226311 0.223985 0.236025 0.248517 0.226066 0.217241 0.250128 0.218615 0.225978
chargesum: 0.00000
title: Mulliken charges with hydrogens summed into heavy atoms:
elementType: O O O O C C C C C C C C C C C C C
charge: -0.267312 -0.265975 -0.232405 -0.224303 0.200911 -0.007404 -0.023255 -0.020553 -0.021171 0.007344 -0.051722 0.224283 0.224980 0.199982 0.200386 0.027046 0.029168
polarizability: 1.65783790e+02 -7.91156454e-01 1.58606591e+02 -1.40909845e-01 8.90962753e-01 1.25929855e+02
1716.lowfreq: -5.4186 -0.0008 -0.0004 0.0002 1.7602 10.3204 16.8687 35.8524 43.7677
frequency: 16.2967 35.7759 43.7565 54.7114 65.9948 80.4252 86.1700 97.7501 128.7022 151.9964 165.2650 201.3868 212.2400 226.3768 237.1772 280.4970 287.0876 320.3045 329.7182 341.3395 401.7421 425.0538 431.4454 441.3867 481.9169 573.0228 575.6360 678.0244 700.4302 724.0689 774.6664 788.4749 790.9325 808.7539 817.9005 832.4260 841.4263 858.5910 887.8937 901.3662 922.2236 942.6831 972.4485 1012.1587 1016.7836 1047.6268 1055.1323 1069.1225 1076.5796 1095.0053 1095.7688 1110.3635 1117.1083 1121.6385 1152.8594 1156.6314 1158.4102 1183.5079 1234.0583 1252.4885 1262.1562 1273.5746 1277.1488 1278.1080 1279.9401 1313.6923 1328.2283 1334.1222 1341.4967 1342.7311 1348.6782 1354.2566 1357.1141 1371.0155 1389.7512 1391.2447 1457.2192 1458.4998 1462.7917 1463.0563 1463.1237 1464.1268 1466.8129 1471.9871 1481.7165 1484.3332 1485.2732 1634.9719 1648.3767 2959.7589 2962.7472 2964.5142 2971.3859 2973.0954 2984.2525 2993.1505 2993.3689 3018.1000 3023.6901 3027.4376 3030.3859 3032.9258 3034.9480 3044.8070 3058.4320 3087.9577 3088.2059 3093.7342 3094.8625 3119.8767 3121.1882
redmass: 4.0626 3.4150 3.6919 2.7421 3.3978 3.8516 3.5489 4.1274 4.5236 3.2856 2.6332 1.2915 1.4241 1.9019 3.7233 3.1127 2.6825 3.5121 1.8588 5.0513 3.7476 2.5830 3.1199 3.3608 1.7460 6.9355 3.2315 4.8762 4.0777 3.6409 2.6188 1.5141 1.8976 1.3035 1.8227 3.2792 3.0775 1.8198 2.2528 1.5749 2.1894 2.6069 2.5826 2.7668 3.0263 1.9685 1.4988 1.6491 1.7203 2.1561 2.1579 1.9404 2.2168 3.6616 2.2404 1.6681 1.7647 1.8802 1.3466 1.4659 1.2772 1.3261 1.1417 1.1178 1.3292 1.3321 1.3768 1.3644 1.4571 1.4505 1.3966 1.2740 1.3399 1.4866 1.2341 1.2304 1.0920 1.0892 1.0477 1.0553 1.0764 1.0884 1.0872 1.0853 1.0759 1.0527 1.0667 9.0989 9.9657 1.0632 1.0614 1.0825 1.0618 1.0634 1.0638 1.0361 1.0360 1.0820 1.0981 1.0943 1.0596 1.0595 1.1028 1.1013 1.0994 1.0973 1.0975 1.1030 1.1030 1.1062 1.1064
irintensity: 0.6445 1.0180 0.8221 0.9063 0.6343 0.6650 0.6028 0.2017 1.7386 0.7005 3.5213 3.7230 1.2720 0.2374 1.5499 2.2447 5.6268 3.9949 1.5849 18.5418 3.1134 1.1089 0.0976 5.8954 1.8812 14.5302 2.9234 8.1088 6.1731 8.7048 1.7074 0.1363 2.2445 2.1718 7.1531 3.7053 2.8536 1.1786 3.4508 12.3812 10.2031 17.0805 9.3258 25.6515 108.3010 15.4043 9.1683 125.8745 140.3616 17.1515 34.5837 70.0286 92.6256 151.7558 12.1609 12.7608 26.0497 67.2678 17.7660 49.8459 0.8159 14.8265 5.3961 1.2987 64.3932 6.5963 35.1089 0.3051 1.1349 2.7332 1.1795 1.0872 5.5833 1.9246 22.5554 22.0794 13.7311 12.6131 16.9235 7.1044 6.2963 6.0162 6.1923 17.8800 15.9866 16.7224 4.3161 135.5241 157.0542 33.9448 30.8100 14.3214 38.2565 54.4682 36.0818 26.7223 11.2803 5.1068 70.0203 58.1249 29.1787 26.4671 23.4359 42.9575 59.7062 33.0909 41.1510 1.2362 1.5257 30.6013 32.1593
temp: 298.150 k
press: 1.00000 atm
elementType: 8 8 8 8 6 6 6 6 6 6 6 6 6 6 6 6 6 1 1 1 1 1 1 1 1 1 1 1 1 1 1 1 1 1 1 1 1 1 1
symmnumber: 1
zpe: 874799.8 jmol-1
zpe.correction: 0.333194 hartree
zpe.thermalcorrener: 0.352199 hartree
zpe.thermalcorrenthalpy: 0.353143 hartree
zpe.thermalcorrgfe: 0.283716 hartree
zpe.sumelectzpe: -808.133919 hartree
zpe.sumelectthermal: -808.114914 hartree
zpe.sumelectthermalent: -808.113970 hartree
zpe.sumelectthermalfe: -808.183397 hartree
dipole: -0.4469 0.8878 2.0843
dipole: 2.3091
quadrupole: -87.9061 -98.0917 -107.6405
quadrupole: -4.0866 0.8545 0.9698
quadrupole: 9.9733 -0.2122 -9.7611 -4.0866 0.8545 0.9698
hfenergy: -808.4671129 hartree
pointgroup: C01 [X(C13H22O4)]
dipole: 0.356275 -0.1161113 0.8276015 debye
polarizability: 163.3345092|3.524926|160.9716511|0.9663141|-1.6161633|126.0140759 unknown
InChI: InChI=1S/C13H22O4/c1-3-16-12(14)11(13(15)17-4-2)10-8-6-5-7-9-10/h10-11H,3-9H2,1-2H3
charge 0 multiplicity 1
39 atoms
O  -1.585377 -2.201406 0.468624
O  2.152255 -0.833639 1.152502
O  -2.028171 -0.410056 -0.953635
O  1.297267 -1.663143 -0.855033
C  0.002058 1.232891 0.5461
C  0.323389 1.718112 -0.891169
C  -1.244641 1.96311 1.111974
C  0.515373 3.253725 -0.920377
C  -1.050871 3.498339 1.078836
C  -0.720718 3.990018 -0.35074
C  -0.136688 -0.320497 0.679097
C  -1.341209 -0.9286 -0.047062
C  1.140325 -1.02654 0.209635
C  -2.689189 -2.984942 -0.169836
C  3.498363 -1.393424 0.807891
C  -4.032793 -2.667695 0.49288
C  4.28848 -0.414762 -0.065322
H  0.866313 1.500446 1.191337
H  -0.503841 1.429577 -1.565308
H  1.237225 1.218601 -1.269502
H  -1.440591 1.627835 2.151033
H  -2.130987 1.695492 0.505321
H  1.40886 3.526079 -0.31951
H  0.713924 3.58654 -1.957576
H  -1.96293 4.000241 1.456332
H  -0.222616 3.78075 1.761996
H  -1.59229 3.80066 -1.010371
H  -0.548171 5.083935 -0.348546
H  -0.251967 -0.559248 1.753802
H  -2.704633 -2.749417 -1.24812
H  -2.384615 -4.03184 -0.012608
H  3.969469 -1.547255 1.79174
H  3.352428 -2.361454 0.297331
H  -4.320018 -1.618147 0.313832
H  -3.98847 -2.848032 1.580787
H  -4.819484 -3.317875 0.066873
H  3.804699 -0.287672 -1.048161
H  5.309036 -0.80636 -0.232665
H  4.373405 0.570556 0.424621
