program: Gaussian 09
title: 000240493
version: EM64L-G09RevD.01
frameworkgroup: C1[X(C16H14N8O4)]
method: RPBEPBE
basis: SDD
operation: Freq
keyword: #p
keyword: freq=noraman
keyword: PBEPBE/SDD
title: #p freq=noraman PBEPBE/SDD
converged: YES YES NO YES
title: Mulliken charges:
elementType: O O O O N N N N N N N N C C C C C C C C C C C C C C C C H H H H H H H H H H H H H H
charge: -0.202934 -0.202934 -0.204444 -0.204445 0.021862 0.021862 -0.110896 -0.110896 -0.165719 -0.165719 -0.593742 -0.593742 0.465151 0.465151 0.381368 0.381367 -0.494672 -0.494671 -0.370152 -0.370152 -0.358338 -0.358338 -0.182597 -0.182598 -0.367095 -0.367095 0.152936 0.152937 0.286465 0.286465 0.264434 0.264434 0.289769 0.289770 0.241410 0.241410 0.243322 0.243321 0.357216 0.346658 0.357216 0.346658
chargesum: 0.00000
title: Mulliken charges with hydrogens summed into heavy atoms:
elementType: O O O O N N N N N N N N C C C C C C C C C C C C C C C C
charge: -0.202934 -0.202934 -0.204444 -0.204445 0.021862 0.021862 -0.110896 -0.110896 -0.165719 -0.165719 0.110132 0.110132 0.465151 0.465151 0.381368 0.381367 -0.208207 -0.208207 -0.105718 -0.105718 -0.068569 -0.068569 0.058813 0.058812 -0.123774 -0.123774 0.152936 0.152937
polarizability: 7.55621645e+02 1.62217214e+01 2.61215679e+02 1.48748041e-03 1.17137018e-03 9.29587339e+01
1716.lowfreq: -9.5006 -0.0015 -0.0008 0.0005 0.9347 1.0310 10.2206 17.8672 19.9517
frequency: 10.2206 17.8672 19.9517 24.2557 44.9714 52.7085 54.1441 68.8706 79.9001 113.9351 119.8111 138.8185 139.2549 168.9543 176.9870 180.0894 195.7725 233.4408 255.9557 263.2888 274.0709 308.5286 335.7383 367.6935 372.8180 383.1468 385.3014 425.1047 426.4031 428.1172 470.2948 512.3885 514.0384 523.5245 539.6776 544.2686 555.3826 617.0784 630.6767 643.3323 643.7310 665.0291 667.8597 675.1623 685.0115 686.6592 689.6197 704.0766 704.2030 706.5583 745.6085 776.8208 777.8773 824.9045 824.9240 862.8277 906.5856 916.9357 923.1647 923.4448 955.2772 955.2817 976.8239 976.8497 980.1282 986.5372 987.0247 1006.8040 1006.8293 1008.5445 1079.2047 1080.6885 1084.7848 1089.2087 1090.5021 1107.7141 1170.5499 1170.6630 1211.2584 1212.0210 1235.9570 1237.2807 1296.7568 1297.0120 1310.1204 1332.3634 1340.0395 1372.8054 1373.3015 1393.6520 1396.2484 1431.0874 1432.5323 1465.3379 1476.1178 1479.3369 1490.9421 1497.8644 1550.0710 1569.1879 1574.6327 1588.5762 1594.9932 1612.7889 1615.1128 1625.8185 3037.5564 3037.5902 3150.0208 3150.0384 3165.3808 3165.3923 3171.3394 3171.3553 3188.4314 3188.4410 3488.2819 3492.2136 3656.8848 3657.2072
redmass: 9.6444 5.9900 9.0734 5.4281 8.4969 11.4350 7.5724 7.0594 5.4059 7.6935 9.6775 6.9346 6.9829 5.4919 5.0307 4.8823 5.7525 3.3735 2.9719 5.5133 5.2312 4.8981 5.8423 4.6719 6.9223 7.7777 7.3814 3.2320 3.3707 5.6628 9.6311 3.4651 6.0691 6.1535 4.9645 5.7018 3.2176 1.2009 6.3614 7.2119 1.2904 1.0472 7.4837 1.3906 9.1594 2.1658 2.0118 5.9645 6.1169 4.3444 10.9607 8.6100 8.3036 1.4654 1.4664 3.7924 3.8725 3.1624 1.4265 1.4288 1.3926 1.3928 1.5852 1.5824 9.1624 6.2004 6.3118 1.3686 1.3688 4.3751 1.8818 1.7335 2.1732 1.6451 1.9230 2.2333 1.1354 1.1324 4.5182 4.6764 2.4293 2.4149 1.4095 1.4172 3.5236 1.8659 1.8569 10.0194 10.3362 5.4737 4.9653 4.3592 4.0104 2.6160 2.7896 3.0126 1.9269 1.7771 2.3572 5.0600 5.9812 4.9056 7.1045 7.0758 7.0382 5.7065 1.0884 1.0884 1.0878 1.0878 1.0920 1.0920 1.0943 1.0943 1.0967 1.0967 1.0435 1.0444 1.1050 1.1043
irintensity: 2.7044 0.7605 2.2046 0.0000 0.0000 0.3635 0.0000 0.0000 0.3254 1.7135 0.0000 0.0000 17.3471 0.0000 0.0118 0.0000 8.4821 4.6990 0.0000 0.0000 10.5668 6.7893 12.2851 0.0000 0.0000 1.5147 0.0000 1.8766 0.0000 10.4845 0.0000 46.8570 0.0005 0.2703 0.0000 0.0000 10.9681 0.0000 30.8934 0.0000 429.9848 0.0000 102.0637 0.1077 0.0001 0.0000 122.0401 0.0001 23.1925 17.1571 0.0000 30.3761 0.0000 65.4660 0.2163 0.0000 0.9390 0.0000 3.5544 0.0000 4.5288 1.2084 0.0689 84.9486 158.8419 0.0000 4.2884 0.0092 4.6743 0.0000 0.0000 39.4599 0.0000 53.3391 0.0000 11.2743 56.5219 0.0026 569.0540 0.0001 202.0972 0.0000 11.1074 0.0000 99.5883 0.0000 70.8676 0.0004 206.4615 0.0000 18.6939 0.0000 29.1909 0.0000 197.7088 0.0000 657.3862 0.0000 380.3098 0.0000 342.2675 0.0000 472.0421 0.0000 14.9332 0.0000 34.1494 0.4177 17.3449 0.3069 8.2705 0.0584 15.9284 1.2234 5.9940 5.9870 0.0000 253.6520 211.6851 0.0000
temp: 298.150 k
press: 1.00000 atm
elementType: 8 8 8 8 7 7 7 7 7 7 7 7 6 6 6 6 6 6 6 6 6 6 6 6 6 6 6 6 1 1 1 1 1 1 1 1 1 1 1 1 1 1
symmnumber: 1
zpe: 785794.3 jmol-1
zpe.correction: 0.299293 hartree
zpe.thermalcorrener: 0.324354 hartree
zpe.thermalcorrenthalpy: 0.325298 hartree
zpe.thermalcorrgfe: 0.239304 hartree
zpe.sumelectzpe: -1354.828792 hartree
zpe.sumelectthermal: -1354.803731 hartree
zpe.sumelectthermalent: -1354.802787 hartree
zpe.sumelectthermalfe: -1354.888781 hartree
dipole: 0.0000 0.0000 0.0006
dipole: 0.0006
quadrupole: -276.0137 -143.1139 -164.9878
quadrupole: -53.5981 0.0028 0.0016
quadrupole: -81.3085 51.5912 29.7173 -53.5981 0.0028 0.0016
hfenergy: -1355.128085 hartree
pointgroup: C01 [X(C16H14N8O4)]
dipole: -0.0000021 -0.0002328 -0.0000062 debye
polarizability: 754.0150922|-0.0189883|92.9587448|32.4784883|-0.0428222|262.822221 unknown
InChI: InChI=1S/C16H14N8O4/c17-15(21-19-9-11-3-1-5-13(7-11)23(25)26)16(18)22-20-10-12-4-2-6-14(8-12)24(27)28/h1-10H,17-18H2
charge 0 multiplicity 1
42 atoms
O  10.134798 -0.330837 0.68437
O  -10.134798 -0.330328 -0.684364
O  8.706603 -0.330415 2.461823
O  -8.706607 -0.329109 -2.461823
N  8.948904 -0.3306 1.193632
N  -8.948907 -0.329784 -1.193632
N  2.948641 -0.328896 -0.272582
N  -2.948642 -0.328885 0.272566
N  1.740304 -0.329036 0.465374
N  -1.740305 -0.328629 -0.46539
N  0.659415 -0.32804 -1.700069
N  -0.659416 -0.329145 1.700053
C  5.375385 -0.329672 -0.077139
C  -5.375385 -0.329464 0.077127
C  7.790217 -0.330365 0.261778
C  -7.790218 -0.329986 -0.261782
C  6.489433 -0.32994 0.801734
C  -6.489436 -0.329313 -0.801743
C  5.608673 -0.329912 -1.485072
C  -5.608669 -0.330361 1.485061
C  8.033901 -0.330572 -1.128259
C  -8.033899 -0.33084 1.128255
C  6.920015 -0.330355 -1.998234
C  -6.920009 -0.331034 1.998227
C  4.023298 -0.329249 0.492436
C  -4.0233 -0.328785 -0.49245
C  0.665706 -0.328579 -0.338814
C  -0.665707 -0.328763 0.338798
H  6.360826 -0.329813 1.888591
H  -6.360832 -0.328681 -1.8886
H  4.743254 -0.329784 -2.154601
H  -4.743249 -0.330547 2.154587
H  9.062641 -0.330889 -1.497206
H  -9.062637 -0.331319 1.497204
H  7.082548 -0.33054 -3.080791
H  -7.082539 -0.331719 3.080784
H  3.923675 -0.329597 1.592088
H  -3.923679 -0.328542 -1.592103
H  -0.246994 -0.327865 -2.171844
H  1.553948 -0.327943 -2.187877
H  0.246993 -0.329342 2.171828
H  -1.553949 -0.329324 2.187861
