program: Gaussian 09
title: 000240474
version: EM64L-G09RevD.01
frameworkgroup: C1[X(C16H19N3O2)]
method: RPBEPBE
basis: SDD
operation: Freq
keyword: #p
keyword: freq=noraman
keyword: PBEPBE/SDD
title: #p freq=noraman PBEPBE/SDD
converged: YES YES NO NO
title: Mulliken charges:
elementType: O O N N N C C C C C C C C C C C C C C C C H H H H H H H H H H H H H H H H H H H
charge: -0.217033 -0.212812 -0.153505 0.000986 -0.703966 -0.337507 0.480482 0.423470 -0.748069 0.166992 -0.414523 -0.437477 -0.325512 0.395475 -0.367317 -0.380991 -0.595754 -0.465444 0.566154 -0.646472 -0.646655 0.259635 0.206678 0.225085 0.254483 0.229596 0.239904 0.259935 0.234200 0.232571 0.271336 0.223357 0.232814 0.214879 0.231979 0.215351 0.232669 0.230621 0.313832 0.310552
chargesum: 0.00000
title: Mulliken charges with hydrogens summed into heavy atoms:
elementType: O O N N N C C C C C C C C C C C C C C C C
charge: -0.217033 -0.212812 -0.153505 0.000986 -0.079581 -0.077872 0.480482 0.423470 -0.061823 0.166992 -0.184927 -0.197573 -0.065577 0.395475 -0.133118 -0.148420 -0.324418 -0.242087 0.566154 0.033200 0.031986
polarizability: 3.43347281e+02 -3.43182924e+00 1.97384533e+02 2.38562757e+01 -4.18476392e-01 1.65756644e+02
1716.lowfreq: -6.8987 -4.3112 -3.4557 -0.0004 -0.0003 0.0002 22.1198 28.6849 32.5981
frequency: 21.9776 28.6706 32.5281 71.8044 74.8914 79.6642 94.6937 122.1040 144.3380 163.5669 168.1499 199.7930 213.0899 216.3830 254.1644 262.9895 281.7530 323.2384 330.9711 363.6182 369.9290 385.1470 392.2908 402.5358 415.9833 430.8301 441.3758 481.8283 484.4119 527.0988 531.1212 573.0883 605.8440 635.6418 661.3176 687.8688 691.2444 729.4253 740.4767 747.1213 755.8283 800.3895 806.4601 819.9247 834.4011 878.7144 920.0305 938.1619 943.5081 954.2253 965.3933 984.1681 998.8656 1034.7520 1041.4402 1055.9378 1057.9422 1064.5886 1109.7274 1111.1575 1136.3166 1148.0851 1164.4842 1191.0114 1199.7236 1205.7925 1222.3907 1245.8060 1264.2914 1282.1630 1297.2988 1322.7686 1326.3209 1356.0909 1357.3981 1375.6180 1383.9732 1391.4672 1423.1791 1436.4991 1438.2296 1458.7407 1462.4041 1472.8434 1473.1127 1485.4533 1494.4446 1506.6001 1507.2575 1527.1114 1559.7425 1564.3982 1632.8067 1635.3023 1648.1051 2932.1063 2940.8086 2981.4675 2995.3676 2998.4763 3010.6332 3075.8995 3091.9747 3097.5445 3102.1101 3111.1979 3123.0312 3132.5527 3150.3043 3157.5809 3161.8944 3165.2384 3568.7295 3708.6572
redmass: 3.4793 6.2468 4.6458 6.4992 2.3375 4.2024 2.2495 2.3475 3.8212 4.3141 6.3621 1.1484 2.2670 3.3915 3.0551 3.6728 1.0702 3.9662 5.3922 1.2187 3.6194 1.2573 4.4743 3.3065 2.9418 3.2029 4.1485 3.5564 4.6614 2.7239 3.5615 3.0267 4.0940 7.0404 6.3458 3.8353 4.4235 4.7684 4.0654 4.0514 5.9144 3.6033 1.2663 1.8427 1.4718 1.6711 4.5131 1.3618 3.0490 1.3559 1.3689 2.4695 2.4934 1.9301 1.7017 1.5284 1.7981 2.4528 1.3177 1.2379 1.4732 1.4774 1.7230 1.9240 1.5299 3.0913 1.7714 1.8848 2.8919 1.7610 1.3919 2.3278 1.4254 5.3821 3.3315 4.8693 1.3113 3.2370 1.9596 1.6744 3.4440 1.2154 1.0407 1.0631 1.0469 1.0583 1.0839 1.2944 2.4026 2.5657 6.8945 6.5992 5.9449 2.0423 1.9231 1.0371 1.0398 1.0363 1.0991 1.1025 1.0813 1.1001 1.0957 1.0988 1.0936 1.0892 1.0882 1.0869 1.0951 1.0932 1.0942 1.0915 1.0450 1.1041
irintensity: 0.2878 0.4594 1.7731 1.8939 0.0432 3.9169 2.6958 0.2517 1.7008 0.4542 0.4521 0.1095 3.0954 1.0468 0.4502 0.6014 0.1442 4.3914 2.2130 75.4975 18.5976 192.9535 14.4934 12.6682 0.1424 0.6890 5.0315 2.9843 1.1573 17.9100 5.6226 13.0458 5.3541 0.0189 2.2553 0.9800 4.3022 2.1998 1.1751 1.0369 21.9123 8.7584 1.1625 61.4766 28.3566 40.5780 9.5076 0.3731 23.3540 0.1900 0.6932 1.0201 5.8021 5.7246 3.6332 25.9600 9.7271 2.6876 1.7668 0.0109 3.2799 22.8900 13.2917 136.0436 48.0465 240.8274 23.6701 18.4801 34.5585 7.8518 42.0094 37.2036 14.7880 114.8120 147.4203 26.3142 12.8185 40.5989 9.3173 3.7877 4.4444 18.8177 0.0470 11.4902 21.1490 6.7367 1.7950 121.2347 130.0290 244.0210 7.6910 11.2789 237.6106 5.0834 315.4752 120.2735 125.3952 26.2040 9.1683 86.2763 11.0230 32.0392 4.3492 24.6551 53.5745 12.2315 13.5620 10.8299 7.7296 30.1794 12.6236 6.4646 93.9335 23.2649
temp: 298.150 k
press: 1.00000 atm
elementType: 8 8 7 7 7 6 6 6 6 6 6 6 6 6 6 6 6 6 6 6 6 1 1 1 1 1 1 1 1 1 1 1 1 1 1 1 1 1 1 1
symmnumber: 1
zpe: 846725.1 jmol-1
zpe.correction: 0.322501 hartree
zpe.thermalcorrener: 0.343221 hartree
zpe.thermalcorrenthalpy: 0.344165 hartree
zpe.thermalcorrgfe: 0.271878 hartree
zpe.sumelectzpe: -934.183883 hartree
zpe.sumelectthermal: -934.163163 hartree
zpe.sumelectthermalent: -934.162219 hartree
zpe.sumelectthermalfe: -934.234506 hartree
dipole: -3.6958 6.5297 -1.6668
dipole: 7.6860
quadrupole: -99.9674 -119.5948 -122.6974
quadrupole: 19.2374 -7.8832 3.4478
quadrupole: 14.1192 -5.5083 -8.6109 19.2374 -7.8832 3.4478
hfenergy: -934.5063839 hartree
pointgroup: C01 [X(C16H19N3O2)]
dipole: 1.4109739 -2.6341414 -0.4630286 debye
polarizability: 342.1450871|-7.3794271|197.3904077|-27.1139418|-1.8240012|166.9529635 unknown
InChI: InChI=1S/C16H19N3O2/c1-11(12-4-7-14(8-5-12)18(2)3)15-9-6-13(17)10-16(15)19(20)21/h4-11H,17H2,1-3H3
charge 0 multiplicity 1
40 atoms
O  -4.147011 1.545963 1.787006
O  -2.81176 2.673458 0.331112
N  4.945152 -0.53246 0.412231
N  -3.263675 1.571244 0.840075
N  -4.150084 -3.191639 0.213804
C  -0.499119 1.295972 -0.59768
C  0.941747 0.815896 -0.376151
C  -1.510124 0.160538 -0.350268
C  -0.753004 1.918304 -1.996468
C  -2.768876 0.276204 0.309279
C  1.371686 0.482897 0.936182
C  1.89641 0.686649 -1.413808
C  -1.195329 -1.149004 -0.807057
C  3.640117 -0.092002 0.15497
C  2.677856 0.041499 1.207974
C  3.213389 0.246358 -1.166871
C  -3.641255 -0.81818 0.519625
C  -2.051156 -2.247901 -0.643328
C  -3.299303 -2.102576 0.035373
C  5.354275 -0.856235 1.783124
C  5.913417 -0.631899 -0.684596
H  -0.702544 2.098386 0.134972
H  -0.651012 1.167609 -2.80197
H  -0.040949 2.741015 -2.190314
H  -1.774613 2.330989 -2.035851
H  0.66194 0.573623 1.768939
H  1.620365 0.942034 -2.44289
H  -0.22568 -1.298399 -1.293865
H  2.952033 -0.193186 2.240559
H  3.90921 0.171294 -2.007654
H  -4.575448 -0.642968 1.061029
H  -1.754941 -3.230697 -1.030111
H  5.279916 0.021349 2.458775
H  6.402828 -1.194047 1.782518
H  4.736433 -1.669751 2.216072
H  6.876499 -0.995691 -0.292563
H  6.092556 0.34982 -1.170866
H  5.576424 -1.340893 -1.468941
H  -5.030882 -3.089642 0.708949
H  -3.89839 -4.111133 -0.135718
