program: Gaussian 09
title: 000240471
version: EM64L-G09RevD.01
frameworkgroup: C1[X(C16H15ClO4)]
method: RPBEPBE
basis: SDD
operation: Freq
keyword: #p
keyword: freq=noraman
keyword: PBEPBE/SDD
title: #p freq=noraman PBEPBE/SDD
converged: YES YES NO NO
title: Mulliken charges:
elementType: Cl O O O O C C C C C C C C C C C C C C C C H H H H H H H H H H H H H H H
charge: -0.052441 -0.275547 -0.316449 -0.292315 -0.219116 0.209924 0.120992 0.058399 -0.020693 -0.358546 0.233702 0.382616 -0.379225 -0.339728 -0.350669 -0.234265 -0.218749 -0.108753 -0.488844 -0.530844 -0.526905 0.271918 0.258367 0.252160 0.276373 0.257261 0.258415 0.243361 0.214970 0.238127 0.234703 0.255119 0.230439 0.258553 0.233245 0.224444
chargesum: 0.00000
title: Mulliken charges with hydrogens summed into heavy atoms:
elementType: Cl O O O O C C C C C C C C C C C C C C C C
charge: -0.052441 -0.275547 -0.316449 -0.292315 -0.219116 0.209924 0.120992 0.058399 -0.020693 -0.086628 0.233702 0.382616 -0.120858 -0.087568 -0.074295 0.022996 0.039666 -0.108753 0.207615 0.189417 0.189337
polarizability: 2.99305693e+02 9.61938426e+00 1.91208856e+02 -1.96911287e+01 8.63730008e+00 1.34435581e+02
1716.lowfreq: -5.3005 -0.0010 0.0013 0.0017 2.4519 9.8158 23.6795 33.1494 46.3915
frequency: 23.5731 33.1388 46.3640 65.0982 68.5135 77.0459 89.9191 99.2356 117.5788 136.9439 146.6246 154.8858 168.0154 178.8644 202.1079 228.5324 239.5471 257.5441 293.1561 302.0775 328.5058 342.6072 379.3845 389.0359 408.8483 429.8221 466.5989 502.9750 505.8042 532.2543 567.5840 610.4432 621.6833 631.6464 677.6662 692.5972 718.1532 746.0354 783.5522 818.8478 832.0568 834.6316 850.2322 868.6289 917.3908 951.2120 959.9385 965.9076 978.5085 989.1204 1003.7179 1040.4315 1069.5789 1104.9174 1107.8588 1112.0493 1114.3148 1142.2891 1144.1327 1151.6656 1159.5325 1174.1901 1182.3735 1214.4671 1250.7666 1288.0327 1292.8917 1354.6550 1370.3573 1389.8499 1394.3139 1418.1486 1436.2140 1443.1500 1452.6700 1456.8537 1458.4904 1461.3361 1464.7718 1472.6932 1476.5114 1486.2754 1531.1767 1563.2722 1582.4765 1589.2743 1595.2932 2976.0883 2979.0725 2992.2043 3075.0806 3079.2652 3100.7354 3121.9491 3125.1033 3128.1096 3140.2607 3155.1651 3155.6248 3168.2587 3175.3566 3177.8474
redmass: 5.4146 6.3873 3.1954 2.7056 2.2209 2.6789 5.3448 2.9673 2.3552 3.4393 3.2399 1.3786 1.1772 2.7215 8.4220 5.2806 4.2628 7.6604 6.6595 6.7595 7.2404 5.2970 4.8032 6.0820 2.9784 7.0330 4.1361 5.6406 5.4919 5.9813 4.8961 5.8958 7.0867 5.2813 5.8229 4.2528 6.9399 3.4451 5.5562 3.7888 1.4195 1.6763 1.8683 5.0802 7.4879 6.5638 1.4632 1.3794 1.4021 5.9026 3.7897 4.0777 2.8110 1.2355 1.3404 1.2420 1.2378 1.4781 1.4456 1.4111 1.5431 2.5316 1.3523 2.0179 3.3932 3.0473 1.4657 9.6740 5.3916 2.6948 3.7750 1.2755 1.2015 1.4528 1.1141 1.2293 1.1270 1.1137 1.4949 2.4292 1.0716 1.0532 11.2605 7.7578 7.8873 6.9479 6.6633 1.0298 1.0312 1.0301 1.1052 1.1033 1.1020 1.1031 1.1058 1.1035 1.0889 1.0886 1.0884 1.0961 1.0973 1.0970
irintensity: 0.2844 0.0756 0.4513 2.7003 3.9530 0.6242 1.1901 10.3225 6.4866 2.8695 2.0554 1.6400 0.0546 2.9989 2.5734 13.1141 12.5208 4.6930 6.3885 3.4771 5.4066 0.4403 1.2149 4.4703 1.0299 11.8901 25.3157 0.7937 0.7556 16.7514 7.1685 13.3967 1.2981 17.4931 2.6766 8.6689 16.9266 23.3270 27.3529 21.1448 9.7029 27.6638 47.4136 2.9786 121.5208 65.1021 14.4319 1.9048 4.5712 9.5226 49.2948 163.5761 58.9416 0.9354 9.7520 9.8435 12.3483 7.8099 1.2640 1.3940 18.3886 5.0388 22.6244 56.0078 103.2243 382.7022 96.5659 9.2355 14.7795 101.9352 29.9780 2.0867 7.6114 61.8547 9.5976 10.3434 16.4654 23.6795 5.0383 21.0653 5.1932 24.0565 156.1579 61.2381 55.6867 216.0629 17.0468 62.7992 71.9601 46.6762 22.3402 22.5631 32.1613 20.2595 22.9607 20.3131 6.1221 0.0963 0.2731 4.8734 3.4904 4.7679
temp: 298.150 k
press: 1.00000 atm
elementType: 17 8 8 8 8 6 6 6 6 6 6 6 6 6 6 6 6 6 6 6 6 1 1 1 1 1 1 1 1 1 1 1 1 1 1 1
symmnumber: 1
zpe: 710172.4 jmol-1
zpe.correction: 0.270490 hartree
zpe.thermalcorrener: 0.291658 hartree
zpe.thermalcorrenthalpy: 0.292602 hartree
zpe.thermalcorrgfe: 0.218677 hartree
zpe.sumelectzpe: -1378.075813 hartree
zpe.sumelectthermal: -1378.054645 hartree
zpe.sumelectthermalent: -1378.053701 hartree
zpe.sumelectthermalfe: -1378.127626 hartree
dipole: 3.3714 -4.2369 -1.0458
dipole: 5.5147
quadrupole: -125.2577 -131.8016 -123.3793
quadrupole: -8.8400 -4.0794 -3.9253
quadrupole: 1.5551 -4.9888 3.4336 -8.8400 -4.0794 -3.9253
hfenergy: -1378.3463031 hartree
pointgroup: C01 [X(C16H15Cl1O4)]
dipole: -1.4813963 -0.10479 -1.5817146 debye
polarizability: 293.2060422|33.3240638|138.0109779|-13.9806158|-9.1150766|193.7331101 unknown
InChI: InChI=1S/C16H15ClO4/c1-19-13-9-8-12(15(20-2)16(13)21-3)14(18)10-4-6-11(17)7-5-10/h4-9H,1-3H3
charge 0 multiplicity 1
36 atoms
Cl 5.811456 0.05857 -2.171101
O  -0.233359 1.304749 -0.58276
O  -2.953607 0.683134 -1.352019
O  -4.381254 -1.290527 0.207126
O  1.260423 0.183996 2.899763
C  -0.37942 -0.28413 1.210794
C  -0.979073 0.313495 0.061329
C  -2.32583 0.001957 -0.278141
C  1.021661 0.021835 1.661388
C  -1.158764 -1.148571 2.022476
C  -3.045273 -0.95483 0.495024
C  2.154749 0.054728 0.675789
C  -2.468119 -1.507788 1.660712
C  2.113819 -0.662693 -0.547761
C  3.336808 0.757958 1.025826
C  3.226686 -0.675058 -1.413937
C  4.451142 0.773403 0.163477
C  4.376044 0.053856 -1.046748
C  -0.301048 1.451128 -2.052477
C  -3.96561 1.672952 -0.899814
C  -4.651946 -1.807559 -1.156162
H  -0.699411 -1.552848 2.929725
H  -3.060415 -2.209546 2.254128
H  1.217415 -1.232414 -0.815613
H  3.367005 1.287501 1.983324
H  3.206301 -1.240838 -2.34986
H  5.358009 1.326554 0.424021
H  -1.166696 2.064763 -2.345742
H  -0.371265 0.465941 -2.547283
H  0.644815 1.946505 -2.32233
H  -3.484973 2.452363 -0.279971
H  -4.765404 1.172205 -0.324752
H  -4.375352 2.11732 -1.819754
H  -4.328507 -1.08682 -1.926587
H  -5.741055 -1.959003 -1.193231
H  -4.132553 -2.773787 -1.298859
