program: Gaussian 09
title: 000240388
version: EM64L-G09RevD.01
frameworkgroup: C1[X(C21H18BrNO4)]
method: RPBEPBE
basis: SDD
operation: Freq
keyword: #p
keyword: freq=noraman
keyword: PBEPBE/SDD
title: #p freq=noraman PBEPBE/SDD
converged: YES YES NO NO
title: Mulliken charges:
elementType: Br O O O O N C C C C C C C C C C C C C C C C C C C C C H H H H H H H H H H H H H H H H H H
charge: 0.023927 -0.244212 -0.415006 -0.238677 -0.142848 -0.446537 -0.257265 -0.168465 -0.471766 -0.449985 -0.371289 -0.397409 0.145234 0.118848 0.706694 0.260626 0.290611 -0.541443 0.279370 -0.573002 0.220088 -0.378038 -0.315812 -0.395160 -0.416543 -0.218093 -0.231354 0.281559 0.300767 0.253080 0.192734 0.242589 0.237573 0.204911 0.202291 0.207769 0.202549 0.301698 0.358042 0.379537 0.264374 0.246753 0.281275 0.232437 0.237568
chargesum: 0.00000
title: Mulliken charges with hydrogens summed into heavy atoms:
elementType: Br O O O O N C C C C C C C C C C C C C C C C C C C C C
charge: 0.023927 -0.244212 -0.035468 -0.238677 -0.142848 -0.144839 0.024294 0.132302 -0.025952 0.030177 0.035912 0.012908 0.145234 0.118848 0.706694 0.260626 0.290611 -0.183401 0.279370 -0.573002 0.220088 -0.113664 -0.315812 -0.148407 -0.135268 0.014344 0.006214
polarizability: 4.47764903e+02 -1.96470218e+01 2.83801860e+02 1.08767727e+01 -2.38632605e+00 1.35940480e+02
1716.lowfreq: -16.1415 -3.8925 -3.6360 -0.0009 -0.0005 0.0009 3.1030 20.3885 37.6705
frequency: -13.6919 20.3383 37.6652 41.6301 46.1196 67.7096 85.8206 96.5218 110.8500 121.7699 141.2814 142.1269 158.8348 193.8287 210.8015 223.0953 224.6393 249.8410 270.9881 298.9012 319.0341 360.9486 377.8314 395.6527 416.4010 423.6163 438.7127 440.2104 457.6144 491.4532 509.3196 522.8134 537.2285 557.1386 580.5754 598.8280 610.8961 621.1857 644.5464 655.7262 689.7009 695.4789 722.7238 723.8461 739.2454 755.5818 771.2475 780.3411 782.3489 811.8840 838.0039 846.9641 855.1815 869.8303 885.3420 893.7690 902.0575 922.4896 945.2080 965.1384 974.3056 976.1898 998.1867 999.0716 1000.6580 1029.5485 1051.0322 1061.9338 1068.1409 1078.7726 1090.3062 1108.3478 1114.2851 1140.5986 1166.8086 1168.2173 1177.7420 1189.9122 1199.7363 1229.7557 1233.1542 1241.7942 1264.9149 1269.6248 1272.8686 1285.0562 1298.5443 1304.3096 1333.1881 1338.8591 1342.4459 1349.9983 1354.9374 1359.8280 1381.3915 1431.8400 1439.6085 1446.9928 1464.9382 1468.1971 1475.5388 1478.8260 1484.6588 1505.3509 1579.9772 1599.2549 1602.5802 1607.8964 1620.5104 1639.9748 1640.6767 2964.8577 2968.9632 2971.2893 2980.2900 2987.6359 3011.8294 3029.8880 3038.5710 3046.7935 3080.2116 3130.2808 3142.3552 3153.1267 3163.3393 3168.5714 3182.2565 3476.0529 3514.2654
redmass: 5.1633 6.2606 9.2338 7.3850 9.7931 7.1802 6.3626 5.2364 6.6719 5.2110 5.9376 5.3421 5.6997 3.0986 5.6106 20.1946 5.4210 4.4868 6.0093 5.6737 3.2365 4.6973 2.3046 6.8899 3.0582 3.9245 5.3812 3.1839 3.4395 3.9814 3.5379 5.9521 4.0450 2.4911 5.8672 6.2351 3.0944 3.8932 2.2691 5.0300 2.0115 2.8044 6.0791 2.3520 3.9975 1.6592 3.5981 2.4267 2.4970 2.6520 3.1936 6.7860 2.7440 2.3313 1.4702 2.3694 1.5971 1.8813 2.9968 1.4018 4.0160 1.5473 1.3647 4.2651 3.0745 2.1092 2.0241 1.8565 1.8647 2.6555 1.8689 1.6987 1.5428 1.5401 1.3012 1.8630 1.9273 2.3066 2.2578 1.3149 1.3547 1.3315 1.3306 1.3948 2.0696 2.0837 2.1148 1.4091 1.7619 1.5195 2.0394 2.2816 1.5164 1.5519 4.2657 5.4430 2.5189 2.7251 1.0893 1.0903 1.1222 3.4362 1.4772 1.6136 8.1314 7.5890 7.7716 4.8270 7.4481 10.3929 8.9602 1.0703 1.0679 1.0661 1.0706 1.0798 1.0663 1.0963 1.0943 1.0994 1.1011 1.0864 1.0899 1.0947 1.0928 1.1003 1.0934 1.0757 1.0640
irintensity: 0.5286 1.2501 0.8935 0.0231 0.4301 0.5573 8.1962 0.0771 0.5616 0.2622 6.8898 0.6908 1.9732 0.4133 0.3265 0.3031 0.2428 3.3078 5.6431 9.7675 1.7637 0.0847 1.1150 11.2844 6.8811 3.7989 16.9778 6.6703 3.0120 13.9643 9.0272 9.9683 46.5626 23.0043 6.9808 3.1184 47.3527 18.9822 58.3467 8.1604 7.4047 18.6782 3.5850 72.8019 11.3360 34.4561 14.2663 41.1958 2.6404 0.9359 0.8351 20.4835 14.9808 12.2874 12.0574 17.5693 0.1346 31.4611 16.3715 2.7234 82.1659 27.4232 0.4759 44.7952 70.2979 4.8160 198.6707 22.3618 17.3183 14.2469 7.3888 63.0922 10.7429 42.5035 9.6662 1.9294 49.0778 6.3135 19.6982 10.0418 24.1304 7.6755 8.9361 14.6231 18.7884 42.2385 56.2076 3.8935 74.1273 22.2654 100.6921 14.5513 9.5575 4.2856 60.9891 57.0858 11.0984 129.7709 17.4962 1.5938 16.0452 2.5629 434.5811 430.2820 60.5504 134.9534 124.6024 52.9296 16.8944 189.7899 88.6309 11.0339 43.4589 10.2932 93.7352 17.3576 10.1918 24.8833 52.4968 78.0661 28.1592 2.8724 5.0512 12.6609 1.3551 35.4263 17.2677 45.4673 32.2297
temp: 298.150 k
press: 1.00000 atm
elementType: 35 8 8 8 8 7 6 6 6 6 6 6 6 6 6 6 6 6 6 6 6 6 6 6 6 6 6 1 1 1 1 1 1 1 1 1 1 1 1 1 1 1 1 1 1
symmnumber: 1
zpe: 903484.1 jmol-1
zpe.correction: 0.344119 hartree
zpe.thermalcorrener: 0.366604 hartree
zpe.thermalcorrenthalpy: 0.367548 hartree
zpe.thermalcorrgfe: 0.290616 hartree
zpe.sumelectzpe: -1178.281318 hartree
zpe.sumelectthermal: -1178.258833 hartree
zpe.sumelectthermalent: -1178.257889 hartree
zpe.sumelectthermalfe: -1178.334820 hartree
dipole: 0.8914 4.1413 1.3212
dipole: 4.4374
quadrupole: -124.8381 -176.2270 -170.2058
quadrupole: 10.3242 -3.8188 1.7578
quadrupole: 32.2522 -19.1367 -13.1155 10.3242 -3.8188 1.7578
hfenergy: -1178.6254364 hartree
pointgroup: C01 [X(C21H18Br1N1O4)]
dipole: 0.3193716 -1.226551 -1.2005867 debye
polarizability: 448.3972711|19.9811695|255.1249445|-2.8116662|57.80347|163.9850279 unknown
InChI: InChI=1S/C21H18BrNO4/c22-17-9-15-11-5-1-2-6-12(11)19(24)16(15)10-18(17)23-20(25)13-7-3-4-8-14(13)21(26)27/h1-2,5-6,9-10,13-14,23,26H,3-4,7-8H2
charge 0 multiplicity 1
45 atoms
Br 0.029328 -3.318531 -1.464703
O  -1.842663 1.184468 0.984475
O  -6.847296 1.237817 1.450409
O  -6.191489 -0.980111 1.4870
O  2.954753 2.579868 1.417865
N  -1.229376 -0.806168 -0.086856
C  -3.629554 -0.409689 0.371197
C  -4.581159 0.761276 0.738285
C  -4.045243 -1.058301 -0.983704
C  -4.735547 1.784966 -0.42601
C  -4.144523 -0.022826 -2.127494
C  -5.133692 1.107174 -1.756562
C  -2.167281 0.086869 0.441301
C  -5.911307 0.216528 1.236868
C  0.178752 -0.697364 -0.115715
C  2.28051 0.438172 0.350498
C  3.030941 -0.62084 -0.238515
C  0.885089 0.423987 0.422711
C  4.476896 -0.293546 -0.149309
C  0.947856 -1.748328 -0.703999
C  4.608532 0.973088 0.49759
C  2.358142 -1.730537 -0.774191
C  3.239479 1.495313 0.842681
C  5.620772 -0.99208 -0.572584
C  5.864312 1.5540 0.728972
C  6.894696 -0.406951 -0.340044
C  7.019719 0.849436 0.301979
H  -3.7301 -1.189007 1.156557
H  -4.133788 1.313435 1.590547
H  -5.032326 -1.533311 -0.826805
H  -3.364861 -1.885759 -1.269387
H  -3.761897 2.295998 -0.544228
H  -5.476999 2.549911 -0.139543
H  -4.468806 -0.526932 -3.05764
H  -3.14482 0.413514 -2.330789
H  -5.166676 1.865341 -2.561672
H  -6.157079 0.686178 -1.673494
H  -1.607062 -1.659795 -0.510016
H  0.322512 1.241871 0.877713
H  -7.681957 0.838425 1.818102
H  2.892392 -2.565265 -1.235893
H  5.545937 -1.964947 -1.070685
H  5.938876 2.526151 1.227262
H  7.797351 -0.937452 -0.663203
H  8.014553 1.275954 0.468025
