program: Gaussian 09
title: 000020274
version: EM64L-G09RevD.01
frameworkgroup: C1[X(C7H15I)]
method: RPBEPBE
basis: SDD
operation: Freq
keyword: #pfreq=noraman
keyword: PBEPBE/SDD
title: #p freq=noraman PBEPBE/SDD
converged: YES YES NO NO
title: Mulliken charges:
elementType: I C C C C C C C H H H H H H H H H H H H H H H
charge: 0.006122 -0.364894 -0.368560 -0.350698 -0.295616 -0.355029 -0.787682 -0.694276 0.193081 0.193069 0.196329 0.196333 0.188443 0.188472 0.225859 0.225855 0.196050 0.196049 0.287010 0.286996 0.210007 0.210047 0.217032
chargesum: 0.00000
title: Mulliken charges with hydrogens summed into heavy atoms:
elementType: I C C C C C C C
charge: 0.006122 0.021257 0.024102 0.026218 0.156098 0.037071 -0.213677 -0.057190
polarizability: 1.50441023e+02 1.18077210e+01 7.83447863e+01 -6.00296868e-03 -4.71159511e-03 6.80346839e+01
1716.lowfreq: -10.9260 -0.0004 -0.0003 -0.0003 7.9401 9.1057 35.0815 58.8774 64.5981
frequency: 35.0336 58.8649 64.5430 97.2067 126.7954 135.1961 148.1321 197.9314 229.3895 301.4078 387.7524 454.8971 582.0554 723.4982 731.8366 746.9896 806.0465 888.6638 888.9337 976.5228 995.7148 1011.2059 1043.4497 1050.1000 1067.6275 1080.7895 1115.0265 1186.0086 1193.7670 1225.9954 1238.8587 1266.6535 1282.7115 1288.3358 1293.0167 1295.9254 1326.4323 1346.8983 1355.2209 1389.1575 1445.8056 1462.5969 1463.7884 1468.4186 1475.1574 1476.8377 1482.9097 1488.3350 2953.5979 2957.3294 2963.8708 2970.3701 2972.0292 2989.8960 2995.3526 3001.7267 3019.0466 3037.1236 3051.1022 3058.1968 3068.5914 3071.9498 3136.2171
redmass: 3.1184 4.1679 1.7646 2.4723 1.8147 4.9252 2.1322 4.0063 1.1169 3.1929 3.7946 2.8918 4.4689 1.0651 1.0766 1.1355 1.1973 1.2524 1.8261 1.1698 4.7785 3.5092 1.0478 3.3799 2.5204 2.3856 2.3642 1.7778 1.1992 1.4220 1.2684 1.2435 1.0406 1.2984 1.1312 1.0836 1.3746 1.4978 1.6349 1.2160 1.1044 1.0754 1.0687 1.0740 1.0771 1.0424 1.0846 1.0897 1.0590 1.0588 1.0589 1.0584 1.0368 1.0977 1.0595 1.1006 1.1035 1.1046 1.0561 1.1043 1.1008 1.0993 1.1104
irintensity: 0.3834 0.3647 0.1673 0.0863 0.0150 0.8879 0.0207 0.5542 0.0003 1.7498 4.6177 0.1989 30.3653 12.3337 5.3852 6.4878 0.0005 3.0714 4.5888 0.1277 4.7820 0.3152 2.1719 6.8875 2.4635 0.7659 17.7899 0.0000 20.1847 0.6759 37.5814 0.7904 0.0723 15.1455 0.1977 0.4298 4.9899 0.0399 3.1119 10.1768 3.3603 0.0592 0.6801 1.8922 1.4012 12.6789 3.7660 25.5114 2.4144 0.5329 9.6740 126.9842 35.3040 0.2790 29.3027 0.5597 0.0011 60.7813 20.0918 54.9522 103.7408 52.9798 14.0030
temp: 298.150 k
press: 1.00000 atm
elementType: 53 6 6 6 6 6 6 6 1 1 1 1 1 1 1 1 1 1 1 1 1 1 1
symmnumber: 1
zpe: 536195.2 jmol-1
zpe.correction: 0.204226 hartree
zpe.thermalcorrener: 0.215483 hartree
zpe.thermalcorrenthalpy: 0.216427 hartree
zpe.thermalcorrgfe: 0.164231 hartree
zpe.sumelectzpe: -286.572038 hartree
zpe.sumelectthermal: -286.560781 hartree
zpe.sumelectthermalent: -286.559837 hartree
zpe.sumelectthermalfe: -286.612033 hartree
dipole: 2.6608 0.7110 -0.0005
dipole: 2.7542
quadrupole: -72.9482 -66.6131 -66.6498
quadrupole: -0.1806 0.0000 -0.0010
quadrupole: -4.2112 2.1239 2.0873 -0.1806 0.0000 -0.0010
hfenergy: -286.7762642 hartree
pointgroup: C01 [X(C7H15I1)]
dipole: -1.0328538 -0.3275498 0.0094398 debye
dipolederiv: -0.5796676 -0.052716 0.0029036 -0.1788496 -0.1616253 0.001417 0.0046481 0.0008036 -0.1203914 -0.0364668 -0.0139661 0.0012444 -0.1481114 0.0730972 0.0023603 0.0031819 0.0016944 0.1845696 -0.1360159 0.0079524 0.001409 0.2909428 0.1286141 -0.0004692 -0.0025962 0.0008506 0.195365 -0.0809041 0.0082502 0.0010468 0.124872 0.0840476 0.0010762 -0.0007087 0.0016553 0.1844147 -0.2731581 -0.0049649 0.0019916 -0.2696768 0.0012515 0.0031924 0.0054451 0.0017727 0.1348144 0.0158455 -0.0067939 0.0008419 -0.0944814 0.0974629 0.0017736 0.0022878 0.0012428 0.1746249 0.8490043 0.2489409 -0.0071951 0.2856209 0.1744432 -0.0028553 -0.007682 -0.0025725 0.0706294 -0.0897986 -0.0396488 0.0015594 0.0155177 0.0570673 0.0006 0.0005141 0.0009559 0.0961868 0.0338185 -0.0056147 -0.010081 0.0017002 -0.043043 -0.1133861 -0.0063935 -0.1355227 -0.0829974 0.0339495 -0.0039 0.0089705 0.0030636 -0.0356405 0.1119428 0.0050909 0.1341678 -0.0905614 0.0600442 -0.0019671 -0.003954 -0.0097632 -0.0428537 -0.1131377 -0.0025793 -0.1375662 -0.0793889 0.0601059 -0.0007661 0.0027547 -0.0088405 -0.0358352 0.1120051 0.0017033 0.1363828 -0.086497 0.0395798 0.0013801 -0.0026523 -0.0102166 -0.0509866 -0.117785 -0.0098704 -0.1426239 -0.0873639 0.0396422 0.0025908 0.0014972 -0.0090112 -0.0425978 0.11641 0.0090828 0.141149 -0.0958405 0.0667368 0.0002311 0.005007 0.0229124 -0.0163188 -0.100241 0.0016177 -0.1101014 -0.0547477 0.0667383 0.0011063 -0.0062025 0.0237079 -0.0106131 0.0987781 -0.0032869 0.1089368 -0.0603928 0.0278943 -0.0289349 -0.0320733 -0.0009514 -0.0487515 -0.1218226 -0.0087049 -0.1508867 -0.0853978 0.0281538 -0.026369 0.0319131 0.0004841 -0.0394777 0.1202772 0.007579 0.1495994 -0.0950142 -0.0539623 -0.0908345 -0.0406399 -0.035216 -0.0273476 -0.0882671 0.0250668 -0.0920749 -0.0087913 -0.0538163 -0.0887894 0.0435628 -0.0351115 -0.0223083 0.0889913 -0.0236308 0.0932796 -0.0140224 0.0781535 -0.0050392 0.0148743 -0.0569193 -0.0196397 -0.1247083 -0.0342552 -0.138708 -0.0847195 0.0781289 -0.0046572 -0.0159391 -0.0547362 -0.0098108 0.1223132 0.035105 0.1359135 -0.0946158 -0.1740061 0.1045101 -0.0008392 0.1430634 -0.0091342 0.0015353 -0.0016147 0.0016518 0.1001375 unknown
polarizability: 149.2000614|15.0670178|79.5795763|-0.5924271|-0.2371698|68.0408553 unknown
InChI: InChI=1S/C7H15I/c1-2-3-4-5-6-7-8/h2-7H2,1H3
charge 0 multiplicity 1
23 atoms
I  5.035702 0.436624 -0.035471
C  -0.676116 0.419402 -0.009092
C  0.561157 -0.508763 -0.001332
C  -2.013881 -0.35406 0.009106
C  1.894058 0.285609 -0.01829
C  -3.25192 0.571899 -0.000721
C  3.096754 -0.662006 -0.01084
C  -4.585195 -0.206624 0.018991
H  -0.631711 1.096692 0.868915
H  -0.640595 1.070173 -0.907327
H  0.518176 -1.183821 -0.88098
H  0.525759 -1.158779 0.897327
H  -2.059015 -1.033198 -0.867965
H  -2.051618 -1.004419 0.908062
H  1.93717 0.955782 0.861245
H  1.928975 0.931493 -0.916164
H  -3.205589 1.25106 0.874962
H  -3.214066 1.220917 -0.899379
H  3.141513 -1.302718 -0.905252
H  3.150058 -1.27759 0.900594
H  -4.668744 -0.871826 -0.861237
H  -4.662122 -0.838164 0.924243
H  -5.453952 0.476914 0.009305
