program: Gaussian 09
title: 000240366
version: EM64L-G09RevD.01
frameworkgroup: C1[X(C6H8N4O5S)]
method: RPBEPBE
basis: SDD
operation: Freq
keyword: #p
keyword: freq=noraman
keyword: PBEPBE/SDD
title: #p freq=noraman PBEPBE/SDD
converged: YES YES NO NO
title: Mulliken charges:
elementType: S O O O O O N N N N C C C C C C H H H H H H H H
charge: 1.053825 -0.478760 -0.481009 -0.270337 -0.224188 -0.152633 -0.096930 -0.588616 -0.016534 0.071368 -0.004164 0.136859 -0.187169 -0.595450 0.344989 -0.750304 0.279398 0.376104 0.312040 0.277618 0.218025 0.253335 0.269245 0.253288
chargesum: 0.00000
title: Mulliken charges with hydrogens summed into heavy atoms:
elementType: S O O O O O N N N N C C C C C C
charge: 1.053825 -0.478760 -0.481009 -0.270337 -0.224188 -0.152633 -0.096930 -0.212512 -0.016534 0.071368 -0.004164 0.136859 0.092229 0.212233 0.344989 0.025564
polarizability: 1.50099818e+02 -1.36119587e+00 1.51621943e+02 -6.28680722e+00 -7.27066525e+00 1.10583762e+02
1716.lowfreq: -11.8829 -9.4758 -5.9529 0.0010 0.0013 0.0021 33.1017 48.8089 62.8132
frequency: 33.0143 48.7499 62.7697 66.2703 85.6621 106.7537 121.5674 138.8157 162.0821 164.6920 187.2560 217.8824 234.1266 261.5599 270.1040 283.2892 293.6363 369.6937 403.1880 407.2575 433.0445 473.5015 533.5245 539.6311 580.8468 615.7350 632.7034 681.8858 688.6607 725.6104 756.2347 811.0520 822.2792 916.0002 950.4203 956.8076 975.7479 1038.2722 1051.7030 1078.3210 1131.7525 1179.0618 1183.0084 1220.6987 1287.0283 1308.1134 1331.4803 1337.0492 1376.1017 1382.9675 1409.8035 1440.1731 1450.8791 1455.8545 1459.7848 1473.0120 1488.9197 1601.3989 2999.7433 3021.3557 3091.1584 3130.1144 3136.4559 3137.0854 3248.0291 3511.7761
redmass: 4.9613 1.8506 2.2470 5.6747 5.7373 4.4167 6.3983 10.3971 1.4770 4.5855 4.6458 4.9635 8.0561 5.1055 6.9450 6.8054 6.3171 5.7194 6.4000 3.6105 2.0170 3.6028 6.0807 6.8381 2.7565 6.9718 4.1437 7.3864 5.3785 12.8283 12.2220 1.4548 15.4332 6.7344 7.1606 2.2521 3.7647 1.6473 2.8928 2.6989 1.3316 2.1050 2.1118 2.5580 7.6127 3.6367 2.8560 6.3331 1.2070 12.3473 2.1589 3.5738 1.0879 1.1473 1.0455 1.7828 1.0938 7.5323 1.0365 1.0324 1.0984 1.1033 1.1000 1.1034 1.0997 1.0801
irintensity: 2.4122 0.9465 0.0781 1.2699 18.0250 3.7017 3.4669 1.4122 1.7113 4.9142 2.4182 5.8260 0.6264 0.8564 1.2387 1.6649 0.9172 1.8767 57.1840 6.4963 61.1651 207.6684 9.9940 25.0443 0.1478 1.8916 14.7625 2.5898 58.8361 0.5675 44.3501 14.8077 116.0848 9.3016 11.5962 39.9257 33.0581 8.2049 9.3378 2.0673 2.6959 19.5223 55.8828 129.0209 20.9421 2.6287 256.6688 66.1084 30.6431 139.0942 0.5779 13.0017 24.0159 16.2436 21.8579 46.9091 30.9979 135.9577 2.5220 20.9377 5.9843 2.5601 3.0221 6.2155 0.9519 68.8418
temp: 298.150 k
press: 1.00000 atm
elementType: 16 8 8 8 8 8 7 7 7 7 6 6 6 6 6 6 1 1 1 1 1 1 1 1
symmnumber: 1
zpe: 412551.1 jmol-1
zpe.correction: 0.157132 hartree
zpe.thermalcorrener: 0.174146 hartree
zpe.thermalcorrenthalpy: 0.175090 hartree
zpe.thermalcorrgfe: 0.111415 hartree
zpe.sumelectzpe: -1225.131387 hartree
zpe.sumelectthermal: -1225.114373 hartree
zpe.sumelectthermalent: -1225.113429 hartree
zpe.sumelectthermalfe: -1225.177105 hartree
dipole: -3.3270 2.9565 -3.1681
dipole: 5.4632
quadrupole: -108.7088 -88.5158 -108.1253
quadrupole: 21.2353 6.1940 1.3369
quadrupole: -6.9255 13.2675 -6.3420 21.2353 6.1940 1.3369
hfenergy: -1225.2885198 hartree
pointgroup: C01 [X(C6H8N4O5S1)]
dipole: -1.1952877 -1.1692467 1.3505821 debye
dipolederiv: 2.0633258 -0.0887858 -0.0543716 -0.3100964 1.3412554 0.2850316 0.0896835 0.1883475 1.7794328 -0.5990326 -0.0541192 -0.0712278 -0.0095568 -0.6053456 -0.1325155 -0.0526458 -0.0273577 -0.5260997 -0.5836364 0.0144086 0.0355241 -0.0362632 -0.4500566 0.1022511 -0.0072227 0.0024584 -0.6321115 -0.4968627 0.1670874 -0.0253141 0.0543208 -0.6449155 0.3597481 0.2045074 0.0911862 -0.6154057 -0.6639387 0.0774906 -0.0543861 0.0540506 -0.5770816 0.0805243 -0.0591817 0.1168859 -0.1977945 -0.7046516 -0.2059695 -0.0373742 -0.3378619 -0.5681626 0.0060186 -0.0414739 0.0143175 -0.1853625 -0.1110407 0.0253795 -0.0337665 -0.3949037 -0.5215542 -0.1309762 0.0909849 0.1368506 -0.0757824 -0.8724986 0.061666 0.1672443 0.0788078 -0.4514486 -0.0222586 0.3605242 -0.0016675 -1.2429966 -0.4799496 -0.1039199 -0.1341281 0.1709328 -0.2758412 0.0944297 -0.2392836 0.0139588 -0.283653 1.2029969 0.1787149 0.0811864 0.4417672 1.4450465 -0.1168461 0.0865471 -0.2692849 0.1936206 -0.1854987 0.1273406 -0.0963002 0.2651656 0.2350769 -0.0101273 -0.2516821 -0.0996008 -0.2693723 0.1617398 -0.1671736 0.1566214 -0.099231 -0.477605 0.1247841 0.1149427 0.0608354 0.1217436 0.0160391 0.015482 0.082151 -0.0764008 0.1211614 -0.0775968 0.0677417 -0.0449556 0.0398029 0.0874624 0.064597 0.0231471 0.0627829 0.3298406 -0.0373744 0.0121091 -0.0264609 0.1425161 0.5481247 -0.262511 -0.2061211 0.0303528 0.6333656 -0.5879066 -0.6790235 -0.0763097 1.3326611 -0.1301241 0.1732731 0.1195339 0.1590865 -0.1539559 -0.044776 0.2097933 -0.1244758 -0.1435146 0.1324625 -0.0082669 -0.0312735 -0.0002758 0.0397131 0.0478623 -0.0392452 0.0409217 0.1414202 0.2642884 0.0169478 0.148948 0.0165907 0.2025736 0.0168419 0.1784397 -0.0597331 0.1726019 0.0710116 -0.0418133 0.0314728 -0.0254566 0.1066363 -0.0323529 0.0174819 -0.0213241 0.1006958 0.1132923 -0.05451 0.0088252 -0.0316518 0.0781791 -0.0024123 0.010339 -0.0702478 -0.0073285 0.0290934 0.1020856 -0.1000829 0.0079688 0.0189103 0.0504742 -0.0705547 0.1242083 0.0390195 0.0541852 -0.1026851 -0.002255 -0.0555777 -0.0099521 -0.0186996 0.0282079 0.0031287 0.1137951 0.0822666 0.0263342 0.0507443 0.0188576 0.0682916 0.04853 0.07802 0.0255099 -0.0263646 0.000945 0.0389473 -0.0587973 0.0165916 0.1158683 -0.0026537 -0.1090091 0.002809 0.0284764 unknown
polarizability: 148.920949|2.5955205|149.675944|8.9215669|-11.2641941|113.7086302 unknown
InChI: InChI=1S/C6H8N4O5S/c1-4(11)8-16(14,15)6-5(10(12)13)7-3-9(6)2/h3,8H,1-2H3
charge 0 multiplicity 1
24 atoms
S  -0.791115 -0.32512 -1.492566
O  -1.418718 -1.789821 -1.75608
O  -0.333244 0.583925 -2.744168
O  -2.026926 -0.715993 1.251622
O  0.5676 2.375919 -0.560802
O  2.809161 2.421942 -0.094021
N  0.925737 -1.714411 0.36508
N  -1.981383 0.729363 -0.560985
N  2.542307 -0.211186 0.941252
N  1.685204 1.817772 -0.202389
C  0.605763 -0.507166 -0.255363
C  1.617643 0.396516 0.114524
C  2.098606 -1.478823 1.076685
C  0.14183 -2.970158 0.406144
C  -2.401022 0.367189 0.716798
C  -3.322623 1.38255 1.378856
H  2.575663 -2.245519 1.681873
H  -2.10305 1.660056 -0.977117
H  -0.866442 -2.743129 0.785939
H  0.056339 -3.408201 -0.598848
H  0.661839 -3.666561 1.082282
H  -2.813065 2.355635 1.498499
H  -3.607902 1.001148 2.370178
H  -4.233102 1.542974 0.775309
