program: Gaussian 09
title: 000240375
version: EM64L-G09RevD.01
frameworkgroup: C1[X(C19H20Cl2FN)]
method: RPBEPBE
basis: SDD
operation: Freq
keyword: #p
keyword: freq=noraman
keyword: PBEPBE/SDD
title: #p freq=noraman PBEPBE/SDD
converged: YES YES NO NO
title: Mulliken charges:
elementType: Cl Cl F N C C C C C C C C C C C C C C C C C C C H H H H H H H H H H H H H H H H H H H H
charge: -0.077090 -0.077437 -0.211194 -0.159396 0.287250 -0.696805 0.200552 0.445973 0.299470 0.195701 -0.597781 -0.405476 -0.406972 -0.435798 -0.376071 -0.354359 -0.353579 -0.585180 -0.365816 -0.388579 0.342363 -0.635021 -0.634501 0.247904 0.248526 0.253881 0.248085 0.243009 0.248310 0.244706 0.238580 0.240067 0.302647 0.303453 0.243177 0.267768 0.252834 0.224879 0.231769 0.246273 0.225050 0.232734 0.246094
chargesum: 0.00000
title: Mulliken charges with hydrogens summed into heavy atoms:
elementType: Cl Cl F N C C C C C C C C C C C C C C C C C C C
charge: -0.077090 -0.077437 -0.211194 -0.159396 0.287250 -0.200374 0.200552 0.445973 0.299470 0.195701 -0.343900 0.085618 0.086043 -0.197218 -0.136004 -0.051712 -0.050126 -0.317412 -0.122639 -0.135745 0.342363 0.067899 0.069377
polarizability: 3.85175712e+02 -3.37252583e-01 2.37811194e+02 2.60504387e+00 3.52697554e+01 1.44283299e+02
1716.lowfreq: -7.2147 -3.8803 -1.3960 -0.0009 0.0018 0.0023 25.8889 27.5858 30.3859
frequency: 25.8034 27.5005 30.3274 30.8175 47.3088 65.2345 66.9438 122.5126 131.8314 166.8280 175.6111 193.5624 224.8942 234.3798 241.1531 244.8293 257.3424 266.9968 289.4919 304.4577 320.6936 338.7734 366.9649 387.6758 403.8074 423.6357 432.5737 441.1186 465.2685 491.9712 524.3459 532.9178 544.6817 569.4421 596.6187 599.5468 626.8405 659.5176 705.1669 706.8753 714.3570 753.1854 758.0338 811.6402 823.1182 845.1652 858.4889 867.0035 870.1051 882.1866 906.5813 915.9532 923.4623 940.8746 943.4385 958.3892 980.6063 1002.9805 1006.5985 1008.9238 1074.0089 1091.8142 1120.7551 1129.6055 1131.4140 1133.2945 1135.4739 1144.2101 1172.0589 1189.6774 1199.2194 1209.2121 1214.2806 1219.5647 1241.5703 1258.2133 1267.6696 1286.8397 1313.3890 1334.4825 1342.5000 1344.0743 1352.4574 1370.7604 1377.1128 1385.4703 1387.1170 1389.6260 1426.6629 1437.0999 1459.0547 1462.5864 1463.7788 1465.1896 1471.8250 1473.6096 1479.2528 1495.5034 1499.8219 1582.0099 1596.9134 1622.4810 1633.1873 2984.9456 2986.0461 2986.2755 3003.9689 3008.4325 3029.7383 3063.9071 3068.5526 3075.6044 3078.7139 3088.9077 3089.5362 3107.8828 3109.0681 3131.1018 3141.6334 3146.4179 3161.3551 3164.3143 3175.7187
redmass: 6.0547 6.1014 5.4862 8.8271 4.7836 3.6459 5.9897 5.3672 5.6866 4.5138 4.9133 7.5330 1.9798 2.1556 2.0074 1.7161 2.1956 2.0646 4.8248 3.7256 3.2719 5.2122 4.2168 4.6780 4.1752 2.6716 2.5436 2.7551 2.7086 4.7007 3.8552 3.1703 3.7923 5.5773 3.0565 5.1632 4.4708 3.7145 3.7190 4.4144 6.2224 3.3044 5.7841 1.4023 1.5842 1.4619 3.2077 2.5974 1.4430 3.5167 1.3869 3.7038 1.4240 1.4341 1.4064 2.0209 3.8203 1.4805 1.4972 2.9783 1.7903 1.9160 1.8725 1.8383 2.1773 2.1506 1.1482 2.1809 1.6130 1.7696 2.0177 1.7263 1.5623 1.5013 1.5721 1.6441 1.3653 1.7265 1.9521 1.2443 1.2954 1.6137 1.3912 4.5737 2.1763 2.5892 1.2364 1.3432 1.1348 4.7648 2.1828 1.0573 1.1688 2.6570 1.1154 1.0756 1.1688 1.8465 1.5966 6.9992 7.6914 7.6176 7.2677 1.0608 1.0367 1.0367 1.0617 1.0631 1.0995 1.0974 1.0932 1.0979 1.0996 1.0937 1.0941 1.0993 1.0988 1.0889 1.0897 1.0905 1.0932 1.0937 1.0958
irintensity: 0.2914 1.5455 0.5782 0.6347 0.7211 0.2534 0.0572 0.9878 0.2268 0.1731 0.5397 1.7032 0.2886 16.3799 1.4598 0.4228 1.0453 4.2670 2.4931 5.0644 0.1993 5.6671 5.6064 0.5826 7.3941 11.8142 3.3638 1.5037 6.0176 9.6125 7.6500 3.0390 27.3524 2.9017 3.6768 26.1499 12.8768 49.2846 3.3062 3.0357 7.7265 0.0499 5.2183 84.6221 4.0738 32.4308 16.1795 4.0525 6.1346 1.7168 9.2100 26.4814 16.1578 2.6474 0.2275 14.5054 7.3791 42.8133 25.1434 21.0151 83.6340 2.4836 77.6767 6.1869 7.2864 1.2847 0.1568 9.5149 12.7074 3.6391 1.5366 80.0724 9.9467 52.3089 60.5000 8.5737 9.5723 6.0672 3.7930 5.1765 43.0428 86.9609 16.0304 3.5129 57.1724 10.3069 27.6415 14.3189 18.2275 41.2681 22.4095 6.8297 17.5953 290.8964 1.9988 8.2917 19.1137 2.4971 103.4657 36.9323 16.8997 3.6171 243.5905 11.6120 6.0557 17.7940 32.4276 23.6206 6.5371 2.7912 7.3166 10.6835 2.1257 8.7471 54.1820 32.2372 19.5975 12.2541 9.0547 16.6050 4.5295 21.8664 8.0277
temp: 298.150 k
press: 1.00000 atm
elementType: 17 17 9 7 6 6 6 6 6 6 6 6 6 6 6 6 6 6 6 6 6 6 6 1 1 1 1 1 1 1 1 1 1 1 1 1 1 1 1 1 1 1 1
symmnumber: 1
zpe: 897464.4 jmol-1
zpe.correction: 0.341826 hartree
zpe.thermalcorrener: 0.363927 hartree
zpe.thermalcorrenthalpy: 0.364872 hartree
zpe.thermalcorrgfe: 0.288003 hartree
zpe.sumelectzpe: -1809.089136 hartree
zpe.sumelectthermal: -1809.067035 hartree
zpe.sumelectthermalent: -1809.066090 hartree
zpe.sumelectthermalfe: -1809.142959 hartree
dipole: -2.4860 0.0546 -0.0111
dipole: 2.4866
quadrupole: -175.9514 -159.1444 -146.8966
quadrupole: -4.3974 -1.5059 1.0722
quadrupole: -15.2873 1.5197 13.7675 -4.3974 -1.5059 1.0722
hfenergy: -1809.430962 hartree
pointgroup: C01 [X(C19H20Cl2F1N1)]
dipole: -0.9782818 -0.0022752 0.0048694 debye
polarizability: 385.1229176|3.4960205|222.4909267|0.0475875|49.4843335|159.6563616 unknown
InChI: InChI=1S/C19H20Cl2FN/c1-12(20)10-23(11-13(2)21)17-4-6-19-15(9-17)7-14-8-16(22)3-5-18(14)19/h3-6,8-9,12-13H,7,10-11H2,1-2H3
charge 0 multiplicity 1
43 atoms
Cl -4.813222 -3.494939 -0.726961
Cl -3.778208 3.886275 0.992503
F  7.038834 0.425106 0.271517
N  -2.712319 0.003264 0.005342
C  0.980724 0.557777 0.37138
C  2.118203 1.399547 0.943623
C  1.51439 -0.532762 -0.377515
C  -1.311166 -0.165232 -0.116094
C  3.362773 0.67328 0.444325
C  2.984441 -0.465856 -0.334967
C  -0.400271 0.751458 0.503559
C  -3.645103 -0.977608 -0.576873
C  -3.27519 1.165188 0.714801
C  0.626897 -1.438397 -0.995854
C  -0.764202 -1.258598 -0.86368
C  -3.765628 -2.253669 0.292211
C  -3.248349 2.445484 -0.156582
C  4.715442 0.98627 0.657694
C  3.97224 -1.299521 -0.907081
C  5.33833 -0.996899 -0.701102
C  5.670502 0.131527 0.071486
C  -4.43212 -2.052387 1.651195
C  -4.175432 2.420586 -1.369583
H  2.080836 2.446276 0.583372
H  2.084501 1.444215 2.049792
H  -0.766525 1.603626 1.084021
H  -3.336968 -1.260102 -1.600432
H  -4.644145 -0.516646 -0.663695
H  -2.734483 1.354415 1.660439
H  -4.322488 0.948702 0.987754
H  1.001782 -2.286968 -1.579235
H  -1.425512 -1.978264 -1.353951
H  -2.79213 -2.759455 0.388333
H  -2.217242 2.709564 -0.438892
H  3.695039 -2.173798 -1.505373
H  5.038901 1.848688 1.248148
H  6.135108 -1.6148 -1.124972
H  -5.448931 -1.636146 1.539975
H  -3.825129 -1.355692 2.260151
H  -4.506121 -3.006748 2.19816
H  -5.224119 2.252919 -1.066908
H  -3.865955 1.606443 -2.05201
H  -4.122183 3.370778 -1.926019
