program: Gaussian 09
title: 000240360
version: EM64L-G09RevD.01
frameworkgroup: C1[X(C13H12O6S)]
method: RPBEPBE
basis: SDD
operation: Freq
keyword: #p
keyword: freq=noraman
keyword: PBEPBE/SDD
title: #p freq=noraman PBEPBE/SDD
converged: YES YES NO NO
title: Mulliken charges:
elementType: S O O O O O O C C C C C C C C C C C C C H H H H H H H H H H H H
charge: 1.016943 -0.400309 -0.581093 -0.534877 -0.513705 -0.270972 -0.323337 0.282486 0.282598 -0.809395 0.474509 0.001906 0.108563 -0.604741 -0.376124 -0.441090 -0.248330 -0.241954 0.223296 -0.493908 0.349205 0.298524 0.280579 0.278903 0.250545 0.238800 0.237671 0.399905 0.373575 0.251803 0.240317 0.249706
chargesum: 0.00000
title: Mulliken charges with hydrogens summed into heavy atoms:
elementType: S O O O O O O C C C C C C C C C C C C C
charge: 1.016943 -0.000404 -0.207517 -0.534877 -0.513705 -0.270972 -0.323337 0.282486 0.282598 -0.161666 0.474509 0.001906 0.108563 -0.324162 -0.097221 -0.190545 -0.009530 -0.004283 0.223296 0.247917
polarizability: 2.83638352e+02 -9.51169117e+00 2.58031644e+02 8.55866533e+00 1.03218478e+01 1.07881923e+02
1716.lowfreq: -7.5840 -4.4857 -0.0022 -0.0020 0.0003 4.4247 23.7222 32.0885 48.5283
frequency: 23.6736 32.0817 48.5193 67.7507 78.7999 93.7982 122.5273 126.2641 132.6284 134.6515 152.5618 163.9950 175.8835 252.4106 273.2835 284.3094 291.0668 300.9355 314.5607 330.2554 371.4785 387.2868 397.1720 428.4259 439.6028 458.7405 508.8751 531.5364 540.4495 587.5688 599.4876 609.4835 684.9421 698.9836 723.3116 753.3877 770.5652 806.7963 819.6810 835.9252 863.5303 871.4618 879.7195 882.2537 925.2740 944.6162 975.1892 978.8848 998.3032 1016.6582 1026.1149 1040.6648 1092.4937 1114.4019 1130.1363 1147.9347 1161.0723 1183.5341 1215.3143 1229.3577 1246.6742 1290.1757 1316.8110 1339.5404 1379.7549 1411.4540 1421.9795 1432.3886 1434.8617 1439.7135 1451.8101 1452.5243 1461.1791 1516.0304 1550.9787 1577.6823 1620.8356 1642.2898 2974.2149 3013.1164 3081.2181 3119.4514 3129.4630 3139.6191 3154.1513 3156.9078 3159.7993 3169.9011 3177.8469 3493.6354
redmass: 9.5058 7.5305 6.4989 4.3769 1.6479 2.2214 5.1844 6.1007 5.5495 3.0986 4.1340 4.5831 2.2138 4.8545 4.4048 5.6188 4.7550 7.6619 6.9885 3.4711 5.7176 4.2079 8.7677 5.2928 8.5550 4.2597 6.1120 6.9111 3.5793 6.3668 6.2808 4.6487 6.5325 5.6565 6.2677 3.1346 1.6078 2.8303 3.6308 10.3381 1.0854 3.3017 3.8082 1.9527 5.0872 1.5338 1.5120 3.7735 1.3678 2.1097 1.6689 2.1277 3.1239 1.2582 1.2535 1.4676 1.8286 1.1471 1.3518 1.4562 2.0021 2.9973 2.1070 2.3201 3.2588 3.4284 1.7277 1.3612 2.7540 2.5478 2.5362 1.0579 1.0672 3.3931 5.3426 6.2272 5.1647 5.2816 1.0695 1.0293 1.0576 1.1052 1.0874 1.0886 1.0950 1.0922 1.1055 1.1006 1.1120 1.0664
irintensity: 1.0607 0.7158 1.8841 1.3316 0.7689 0.9208 6.4254 5.6013 1.1232 17.7155 8.9878 14.2203 45.0987 24.6474 7.2593 63.6955 13.6025 3.0760 6.2906 30.6519 39.2134 16.8539 7.6848 9.6409 1.4658 20.6271 133.4402 89.8420 0.4613 8.7728 4.4382 8.5511 2.8660 16.3464 5.7749 5.8001 53.7628 28.6012 8.8023 31.7264 133.9108 1.2985 8.3582 3.3577 44.3212 8.9967 18.8272 89.8114 0.1675 32.5751 48.4636 3.8538 62.3569 0.0441 14.4489 10.5125 231.5598 31.3962 206.7031 172.5911 29.4826 31.4242 79.6183 164.6945 88.8839 28.6345 51.6958 38.4337 73.4330 7.4691 91.6999 17.2289 10.9827 104.0457 48.5499 66.0026 9.0213 280.2235 605.2182 27.1693 3.8485 19.0831 1.8517 4.3063 9.3799 0.3357 11.0608 28.4005 3.5800 58.5109
temp: 298.150 k
press: 1.00000 atm
elementType: 16 8 8 8 8 8 8 6 6 6 6 6 6 6 6 6 6 6 6 6 1 1 1 1 1 1 1 1 1 1 1 1
symmnumber: 1
zpe: 596856.3 jmol-1
zpe.correction: 0.227331 hartree
zpe.thermalcorrener: 0.247128 hartree
zpe.thermalcorrenthalpy: 0.248072 hartree
zpe.thermalcorrgfe: 0.177598 hartree
zpe.sumelectzpe: -1350.393896 hartree
zpe.sumelectthermal: -1350.374098 hartree
zpe.sumelectthermalent: -1350.373154 hartree
zpe.sumelectthermalfe: -1350.443628 hartree
dipole: 5.9262 3.1171 -1.5556
dipole: 6.8743
quadrupole: -103.8983 -114.1533 -129.7989
quadrupole: 0.6869 8.9261 0.3484
quadrupole: 12.0519 1.7969 -13.8487 0.6869 8.9261 0.3484
hfenergy: -1350.6212262 hartree
pointgroup: C01 [X(C13H12O6S1)]
dipole: 2.1476548 -1.529318 0.6027747 debye
polarizability: 285.8172959|5.9392197|254.9511118|-2.7685222|17.3025111|108.7835108 unknown
InChI: InChI=1S/C13H12O6S/c1-19-13(15)10-6-8-4-2-3-5-9(8)11(12(10)14)7-20(16,17)18/h2-6,14,16H,7H2,1H3
charge 0 multiplicity 1
32 atoms
S  -2.934259 1.729569 -0.390079
O  0.749313 2.132601 0.954214
O  -3.371298 3.34607 0.464095
O  -4.283002 0.828939 -0.510012
O  -2.095925 2.0294 -1.73953
O  4.081605 -0.190146 -0.240469
O  3.256452 1.873643 0.42961
C  -0.693369 0.229538 0.728725
C  -0.885813 -1.162343 0.385108
C  -1.790281 1.088651 1.187672
C  0.260068 -1.965388 -0.00012
C  0.598685 0.804577 0.635084
C  1.735164 -0.003544 0.235971
C  1.546621 -1.359416 -0.063743
C  -2.177175 -1.783615 0.381631
C  0.08439 -3.350566 -0.329892
C  -2.31736 -3.135823 0.050991
C  -1.182561 -3.932363 -0.300211
C  3.058413 0.641297 0.156771
C  5.426933 0.433055 -0.3477
H  -1.469019 2.060162 1.584974
H  -2.593219 0.618002 1.770481
H  2.413446 -1.957087 -0.363885
H  -3.074244 -1.198638 0.607996
H  0.963779 -3.940429 -0.61342
H  -3.314577 -3.588932 0.048696
H  -1.316711 -4.98835 -0.555391
H  1.731929 2.391479 0.829886
H  -4.017244 3.834448 -0.123058
H  5.406893 1.244458 -1.093348
H  6.08518 -0.386432 -0.665773
H  5.734087 0.839779 0.629531
