program: Gaussian 09
title: 000240353
version: EM64L-G09RevD.01
frameworkgroup: C1[X(C20H24N6O2)]
method: RPBEPBE
basis: SDD
operation: Freq
keyword: #p
keyword: freq=noraman
keyword: PBEPBE/SDD
title: #p freq=noraman PBEPBE/SDD
converged: YES YES NO NO
title: Mulliken charges:
elementType: O O N N N N N N C C C C C C C C C C C C C C C C C C C C H H H H H H H H H H H H H H H H H H H H H H H H
charge: -0.280063 -0.280063 -0.121537 -0.121537 -0.165064 -0.165063 -0.603111 -0.603111 0.244995 0.244995 0.245652 0.245653 -0.356695 -0.356695 -0.346670 -0.346671 -0.232906 -0.232906 -0.242718 -0.242718 -0.248857 -0.248857 -0.361546 -0.361546 -0.684565 -0.684565 0.142796 0.142796 0.244284 0.244283 0.257666 0.257666 0.225232 0.225231 0.210008 0.209985 0.210008 0.209985 0.227222 0.227222 0.269855 0.269855 0.233215 0.233231 0.208052 0.208052 0.233230 0.233216 0.341598 0.349943 0.341598 0.349943
chargesum: 0.00000
title: Mulliken charges with hydrogens summed into heavy atoms:
elementType: O O N N N N N N C C C C C C C C C C C C C C C C C C C C
charge: -0.280063 -0.280063 -0.121537 -0.121537 -0.165064 -0.165063 0.088429 0.088430 0.244995 0.244995 0.245652 0.245653 -0.112412 -0.112412 -0.089005 -0.089005 -0.007675 -0.007675 0.177275 0.177275 -0.021635 -0.021635 -0.091691 -0.091692 -0.010067 -0.010066 0.142796 0.142796
polarizability: 7.38897859e+02 -2.36647637e+01 3.13743889e+02 -3.26343654e-03 -3.08501524e-03 1.23971294e+02
1716.lowfreq: -5.1816 -3.0244 -0.0019 -0.0016 0.0008 3.3154 8.6117 18.3491 19.8708
frequency: 8.6117 18.3491 19.8708 30.2828 47.6035 57.4765 67.3395 67.7577 77.9029 96.4110 109.3594 111.2028 111.9029 144.2068 147.4271 158.6085 166.7830 197.5764 197.7210 210.9571 230.6945 235.4641 238.3411 243.4461 279.2274 310.3395 320.2037 324.6622 357.1384 361.3877 372.6483 386.7177 429.6286 473.3533 486.2227 495.4322 502.4529 528.5262 541.1722 547.3356 557.1531 591.7814 593.3481 595.6944 622.0717 624.8988 651.5700 666.6514 680.3832 707.4266 740.2914 743.0240 743.2631 757.3793 757.4940 763.5276 765.4113 825.7394 825.7469 830.1605 849.8976 860.3373 860.3717 895.5626 907.2223 907.8810 945.4880 945.5356 975.2568 978.5537 978.6928 987.0699 987.1834 1002.1842 1034.6340 1034.8372 1042.5979 1042.6239 1076.0833 1093.8768 1104.8956 1111.0355 1117.3498 1117.7189 1136.0584 1136.0597 1170.6331 1170.9114 1200.1173 1200.8499 1230.3501 1231.4874 1263.4264 1263.4275 1288.6365 1288.9400 1305.1281 1324.4083 1332.9428 1366.6148 1367.9740 1385.7030 1387.5331 1400.1976 1400.2474 1438.1809 1438.3291 1458.4917 1460.2650 1460.2668 1469.5252 1472.5173 1479.9352 1480.4581 1488.6435 1490.6769 1492.0779 1494.1905 1544.6042 1568.4090 1573.5848 1586.7686 1589.3033 1604.1521 1605.0815 1618.4900 2957.9194 2957.9890 2997.8112 2997.8206 3016.9684 3016.9794 3084.1993 3084.2420 3095.0006 3095.0254 3107.1687 3107.1782 3130.9562 3130.9669 3147.0966 3147.1014 3163.0261 3163.0341 3172.5017 3172.5925 3491.7842 3495.4986 3661.0167 3661.3472
redmass: 4.3214 6.1124 5.1434 4.3332 4.6297 4.2102 3.6331 3.8598 3.5005 4.7599 1.8799 5.0301 2.0629 4.8830 4.8833 5.0058 4.2385 3.4769 3.4979 3.9848 1.6804 1.2399 3.9724 2.4798 3.9567 4.0967 3.7855 4.2298 4.3111 3.5734 5.7058 4.9934 5.7211 3.0682 3.3111 4.5436 6.0939 2.8378 5.5807 3.5300 2.8226 6.2912 6.3668 1.2167 5.6467 1.4435 6.3865 1.0481 1.2455 4.1052 10.0385 3.3985 3.3780 1.3037 1.3066 4.4577 4.4853 1.1155 1.1155 4.5507 4.1635 1.3984 1.3994 2.8906 3.3663 3.3195 1.3599 1.3603 8.5425 1.3836 1.3842 1.4471 1.4446 5.1895 2.7476 2.7349 2.0830 2.1068 2.5217 2.3773 2.3756 2.1632 2.1075 2.0634 1.4400 1.4400 1.1036 1.0982 1.9170 1.9311 2.5035 2.5509 1.1387 1.1387 1.5271 1.5161 3.3130 1.9716 1.9744 1.4329 1.3692 4.2575 4.4363 1.3201 1.3197 2.4536 2.4770 2.7070 1.0398 1.0398 1.8817 1.6872 1.1872 1.2466 1.6508 1.2876 1.2488 1.6267 2.4587 4.7774 6.7479 5.5365 6.7345 6.4243 6.4224 5.6722 1.0554 1.0554 1.0362 1.0362 1.1077 1.1077 1.0885 1.0885 1.0988 1.0988 1.1015 1.1015 1.0855 1.0855 1.0899 1.0899 1.0941 1.0941 1.0989 1.0989 1.0428 1.0435 1.1056 1.1049
irintensity: 0.3231 0.8940 0.3506 0.0000 0.0000 0.0000 2.0495 0.0000 6.3181 1.2743 0.0000 0.0004 0.6493 5.1044 0.0000 0.0001 0.3349 11.0889 0.0000 0.0000 1.5000 0.0013 11.4779 1.9514 0.0000 7.6312 0.0000 7.7834 18.8968 0.0000 0.0000 12.3807 0.0000 33.8366 0.0000 1.7076 0.0000 22.9232 0.0000 0.0000 36.4051 17.4180 0.0000 0.0003 45.2667 440.1358 0.0000 0.0002 4.2705 7.3562 0.0001 0.0000 0.2742 0.0274 200.9891 27.3879 0.0005 2.4592 0.0046 0.0000 21.7958 0.0232 0.0001 0.0000 82.0212 0.0000 1.5189 0.0005 76.1094 18.4186 0.0040 0.0039 32.0795 0.0000 161.6984 0.0008 26.5481 0.0009 0.0000 48.6937 0.0000 38.3042 0.0000 65.5483 0.2297 9.2360 92.2133 0.0003 137.2459 0.0000 473.8115 0.0001 0.0300 0.0007 14.1820 0.0001 68.8378 0.0000 56.1330 0.0000 12.2430 0.0000 123.6899 74.9970 0.0061 174.7899 0.0013 0.0000 0.1321 24.4054 113.5310 0.0000 0.3717 0.0000 406.6086 0.0000 42.9159 0.0000 306.9704 0.0000 501.5612 0.0000 579.6413 0.0000 50.3993 0.0005 134.8557 0.2084 45.0653 2.2526 4.8311 63.6380 26.9298 0.2838 72.6958 0.5313 4.1356 63.1729 0.3991 0.0358 21.0666 5.0167 2.2212 47.3081 72.5278 0.0517 0.0000 208.2383 200.6067 0.0037
temp: 298.150 k
press: 1.00000 atm
elementType: 8 8 7 7 7 7 7 7 6 6 6 6 6 6 6 6 6 6 6 6 6 6 6 6 6 6 6 6 1 1 1 1 1 1 1 1 1 1 1 1 1 1 1 1 1 1 1 1 1 1 1 1
symmnumber: 1
zpe: 1090590.4 jmol-1
zpe.correction: 0.415384 hartree
zpe.thermalcorrener: 0.443428 hartree
zpe.thermalcorrenthalpy: 0.444372 hartree
zpe.thermalcorrgfe: 0.352734 hartree
zpe.sumelectzpe: -1253.385971 hartree
zpe.sumelectthermal: -1253.357928 hartree
zpe.sumelectthermalent: -1253.356984 hartree
zpe.sumelectthermalfe: -1253.448622 hartree
dipole: 0.0000 0.0000 0.0075
dipole: 0.0075
quadrupole: -86.0572 -138.1090 -173.7269
quadrupole: 17.7375 0.0014 -0.0012
quadrupole: 46.5738 -5.4780 -41.0958 17.7375 0.0014 -0.0012
hfenergy: -1253.8013553 hartree
pointgroup: C01 [X(C20H24N6O2)]
dipole: -0.0000014 0.0029376 -0.0000014 debye
polarizability: 739.4657474|-0.0348378|123.9713144|-17.8397711|0.0601043|313.17598 unknown
InChI: InChI=1S/C20H24N6O2/c1-3-27-17-11-7-5-9-15(17)13-23-25-19(21)20(22)26-24-14-16-10-6-8-12-18(16)28-4-2/h5-14H,3-4,21-22H2,1-2H3
charge 0 multiplicity 1
52 atoms
O  -6.320204 0.383533 1.929348
O  6.320418 0.381806 -1.929536
N  -2.937715 0.382443 -0.38325
N  2.937931 0.382373 0.383064
N  -1.756609 0.382426 0.404015
N  1.756825 0.38189 -0.4042
N  -0.604372 0.380296 -1.72284
N  0.604587 0.381639 1.722656
C  -6.541563 0.38473 0.544271
C  6.541779 0.3838 -0.54446
C  -5.366281 0.384459 -0.277315
C  5.366497 0.384086 0.277127
C  -7.831072 0.385922 -0.041887
C  7.831288 0.385259 0.041696
C  -5.536154 0.385433 -1.689498
C  5.536371 0.385893 1.689309
C  -7.963214 0.38686 -1.447826
C  7.963431 0.387031 1.447634
C  -7.49329 0.385411 2.826645
C  7.493504 0.383155 -2.826835
C  -6.815614 0.386617 -2.276058
C  6.815832 0.387353 2.275867
C  -4.041078 0.38336 0.345236
C  4.041294 0.382687 -0.345422
C  -6.954927 0.385152 4.25476
C  6.955139 0.382178 -4.254949
C  -0.653645 0.381293 -0.358834
C  0.653861 0.381507 0.35865
H  -8.729694 0.386109 0.581109
H  8.72991 0.385019 -0.581301
H  -4.631998 0.385278 -2.306317
H  4.632215 0.386154 2.306128
H  -8.964452 0.387796 -1.893037
H  8.96467 0.38817 1.892844
H  -8.107232 1.287426 2.62665
H  -8.109607 -0.515134 2.627302
H  8.107491 1.285244 -2.627309
H  8.109777 -0.517317 -2.627023
H  -6.923158 0.387381 -3.365715
H  6.923376 0.388758 3.365524
H  -3.98609 0.383903 1.44408
H  3.986305 0.38249 -1.444267
H  -6.334885 1.279203 4.437469
H  -6.337047 -0.5103 4.437927
H  -7.79314 0.386341 4.975106
H  7.793351 0.382967 -4.975296
H  6.337228 -0.513346 -4.437654
H  6.335129 1.276157 -4.438117
H  -1.486581 0.380469 -2.232173
H  0.316851 0.3801 -2.163596
H  1.486796 0.382126 2.231988
H  -0.316636 0.381914 2.163412
