program: Gaussian 09
title: 000240346
version: EM64L-G09RevD.01
frameworkgroup: C1[X(C19H21NO2)]
method: RPBEPBE
basis: SDD
operation: Freq
keyword: #p
keyword: freq=noraman
keyword: PBEPBE/SDD
title: #p freq=noraman PBEPBE/SDD
converged: YES YES NO NO
title: Mulliken charges:
elementType: O O N C C C C C C C C C C C C C C C C C C C H H H H H H H H H H H H H H H H H H H H H
charge: -0.244930 -0.183454 -0.135788 -0.231483 -0.342309 -0.332814 -0.330303 -0.339917 0.436380 0.144445 -0.689080 -0.355297 -0.452555 0.494463 -0.231575 -0.225462 -0.241341 -0.390276 -0.424937 -0.223598 -0.224523 -0.242437 0.219739 0.191913 0.233113 0.240484 0.191432 0.194339 0.212740 0.213233 0.198705 0.253712 0.235026 0.281035 0.237519 0.228866 0.227352 0.230617 0.256662 0.232116 0.229409 0.227471 0.231309
chargesum: 0.00000
title: Mulliken charges with hydrogens summed into heavy atoms:
elementType: O O N C C C C C C C C C C C C C C C C C C C
charge: -0.244930 -0.183454 -0.135788 -0.011743 0.082717 0.099103 0.076776 0.072021 0.436380 0.144445 -0.200342 -0.074262 -0.215035 0.494463 -0.002709 0.001889 -0.010724 -0.133614 -0.192821 0.005811 0.002947 -0.011129
polarizability: 2.48485073e+02 -3.87785772e+01 1.91686000e+02 1.45665361e+01 2.51075053e+01 1.84584538e+02
1716.lowfreq: -12.2949 -7.7254 -0.9108 -0.0005 -0.0004 -0.0003 18.1270 19.6234 25.1829
frequency: 16.9077 19.2041 24.6021 40.8243 54.7462 60.6889 83.4764 95.0524 129.8337 178.3506 196.0245 224.5081 240.2955 276.1850 299.2641 308.7890 324.8051 347.6273 399.2956 403.1794 404.4027 448.5088 462.8045 469.3475 481.1891 529.4448 574.5724 592.3159 610.3368 616.9549 630.7252 688.1877 704.7843 709.8334 750.2584 767.2859 790.9860 797.0695 821.5487 843.2746 849.6216 854.8681 858.6345 859.9255 916.9746 922.3170 935.1410 938.0896 978.1507 982.1219 989.4772 990.4229 996.5686 999.7763 1006.3152 1025.2020 1026.4804 1028.0204 1051.9786 1060.4821 1077.9705 1084.0119 1092.1646 1105.3784 1133.3657 1152.6434 1172.5292 1172.9698 1184.0601 1184.6638 1189.0410 1193.8474 1198.9091 1199.9323 1232.6492 1262.2845 1268.4390 1272.7760 1297.5794 1312.0964 1328.6898 1332.4758 1339.9764 1350.4061 1373.1805 1380.9687 1381.5059 1390.1552 1439.8907 1440.5478 1443.1453 1448.3402 1453.3699 1455.7057 1464.4822 1477.7550 1481.5883 1591.3610 1592.3346 1605.4754 1608.2453 1629.7801 2828.5779 2861.9738 2878.1948 2955.3601 2962.4307 3011.5798 3051.1073 3074.2757 3078.1706 3079.1977 3083.4122 3114.0638 3116.7266 3123.8490 3128.3581 3135.9722 3140.5117 3146.9430 3152.6966 3164.6940 3165.4382
redmass: 4.9324 4.8348 3.8600 3.9224 3.1150 4.8178 4.7565 6.0688 7.5262 4.1817 4.6578 2.8007 2.7117 5.6174 3.2383 3.6865 3.7974 2.7368 1.9222 2.8119 2.8290 3.8408 3.2227 3.8636 3.8418 3.7018 3.0796 5.2192 5.0874 5.8955 2.7599 4.1605 1.8467 1.6413 2.0144 2.0800 3.7655 4.4451 3.8072 1.6217 3.3044 1.2511 1.2675 3.8469 1.9028 1.4588 2.4938 1.6982 1.3905 1.3923 6.1096 6.0044 1.3290 1.3781 2.4143 2.2106 2.2429 2.2003 2.0639 1.9280 1.6392 3.6413 1.6667 2.1817 2.5827 3.7840 1.0595 1.0587 1.3038 1.3304 1.1346 2.3280 1.1295 2.4724 1.4136 1.3772 1.3796 1.3101 1.2035 1.4196 1.2782 1.2829 1.2332 1.3023 1.2828 3.4721 7.2025 1.9230 2.1066 2.1199 1.0845 1.0858 1.0976 1.1251 1.1101 2.2304 2.1747 6.2354 6.1053 6.0356 6.1246 8.6868 1.0796 1.0707 1.0702 1.0665 1.0662 1.0583 1.0885 1.0890 1.1038 1.0963 1.0976 1.0876 1.0873 1.0867 1.0865 1.0914 1.0918 1.0961 1.0955 1.1015 1.1013
irintensity: 0.3983 0.1612 0.0454 0.0956 0.1283 0.1632 1.0391 2.6825 3.2457 3.5701 0.5766 4.1900 0.2501 1.1678 4.8821 4.5631 5.5196 2.2438 0.3850 0.0703 0.2108 1.5277 1.8587 4.0108 17.5221 4.1673 17.7109 21.9238 0.8526 0.0753 9.6195 1.9670 1.2078 144.4472 0.9310 51.9755 1.6522 2.4536 42.8423 0.1276 8.8509 0.3509 0.3266 0.5301 2.8914 0.5273 26.2350 5.8606 0.1856 0.5784 1.8754 0.1202 0.7076 5.1383 33.5164 9.1288 3.7644 11.4253 20.8212 34.2566 10.8462 28.0187 41.4698 1.8062 39.5010 13.2758 0.3021 0.6168 9.6572 34.4452 1.9891 10.3001 1.5346 1.0539 61.0058 28.8004 15.5369 3.8411 7.6564 19.5349 7.1630 2.4466 0.7087 12.9317 2.3398 0.3375 1.5212 5.0263 13.7068 8.7744 2.4094 5.1157 16.0265 14.5402 2.3833 19.2080 21.7291 10.2934 0.2001 11.3218 19.9894 79.6894 63.7711 49.6469 98.7670 48.4521 80.6224 13.9794 26.2813 12.9381 8.0271 39.5768 32.8285 11.9205 7.6278 0.9519 0.5623 11.1829 21.4082 31.3510 18.1969 26.4918 21.7712
temp: 298.150 k
press: 1.00000 atm
elementType: 8 8 7 6 6 6 6 6 6 6 6 6 6 6 6 6 6 6 6 6 6 6 1 1 1 1 1 1 1 1 1 1 1 1 1 1 1 1 1 1 1 1 1
symmnumber: 1
zpe: 931521.8 jmol-1
zpe.correction: 0.354798 hartree
zpe.thermalcorrener: 0.374342 hartree
zpe.thermalcorrenthalpy: 0.375286 hartree
zpe.thermalcorrgfe: 0.303309 hartree
zpe.sumelectzpe: -940.181737 hartree
zpe.sumelectthermal: -940.162193 hartree
zpe.sumelectthermalent: -940.161249 hartree
zpe.sumelectthermalfe: -940.233226 hartree
dipole: -0.3536 -2.8076 -2.0312
dipole: 3.4833
quadrupole: -115.5039 -137.3176 -130.3783
quadrupole: -8.9390 1.7539 8.1468
quadrupole: 12.2294 -9.5843 -2.6450 -8.9390 1.7539 8.1468
hfenergy: -940.5365351 hartree
pointgroup: C01 [X(C19H21N1O2)]
dipole: -0.3421422 0.8449525 1.0232802 debye
polarizability: 232.0764982|49.7406872|196.9328322|-7.8447702|24.7234998|195.7462804 unknown
InChI: InChI=1S/C19H21NO2/c21-18(15-16-7-3-1-4-8-16)19(17-9-5-2-6-10-17)20-11-13-22-14-12-20/h1-10,19H,11-15H2
charge 0 multiplicity 1
43 atoms
O  2.021777 -3.995344 -0.255671
O  -0.132266 0.435378 -2.292742
N  1.268385 -1.180311 -0.367308
C  0.585498 0.065601 0.046436
C  2.175924 -1.701504 0.691648
C  0.328422 -2.253309 -0.798622
C  2.940848 -2.928228 0.170876
C  1.122661 -3.470029 -1.297179
C  1.590058 1.177665 0.387693
C  -0.322138 0.650426 -1.069722
C  -1.483101 1.531206 -0.583675
C  2.565297 1.552753 -0.571733
C  1.544006 1.850355 1.632191
C  -2.658527 0.658023 -0.13859
C  3.484545 2.583891 -0.283425
C  2.463636 2.885311 1.920317
C  3.435522 3.255213 0.962394
C  -3.336418 -0.157772 -1.082066
C  -3.079753 0.633502 1.214855
C  -4.415915 -0.974647 -0.679654
C  -4.161609 -0.182041 1.618842
C  -4.832344 -0.990253 0.672456
H  -0.071388 -0.095879 0.941729
H  1.603097 -1.990922 1.609197
H  2.897957 -0.915153 0.973804
H  -0.299057 -1.878531 -1.624046
H  -0.339735 -2.566999 0.042162
H  3.586567 -2.625929 -0.681998
H  3.561438 -3.372552 0.966762
H  0.4474 -4.303518 -1.551995
H  1.714812 -3.180194 -2.191539
H  -1.776194 2.181842 -1.426427
H  -1.146113 2.167429 0.254104
H  2.593121 1.020395 -1.528876
H  0.80073 1.553566 2.383094
H  4.235971 2.868159 -1.028618
H  2.426004 3.395971 2.88913
H  4.14878 4.056844 1.184574
H  -3.015974 -0.146999 -2.130897
H  -2.568495 1.265058 1.952246
H  -4.932896 -1.596995 -1.418737
H  -4.481256 -0.18481 2.667058
H  -5.670981 -1.622766 0.983952
