program: Gaussian 09
title: 000246552
version: EM64L-G09RevD.01
frameworkgroup: C1[X(C16H18O)]
method: RPBEPBE
basis: SDD
operation: Freq
keyword: #pfreq=noraman
keyword: PBEPBE/SDD
title: #p freq=noraman PBEPBE/SDD
converged: YES YES NO NO
title: Mulliken charges:
elementType: O C C C C C C C C C C C C C C C C H H H H H H H H H H H H H H H H H H
charge: -0.459919 -0.218932 -0.488219 -0.220514 0.507058 -0.712515 0.501769 -0.406293 -0.442339 -0.441073 -0.382982 -0.241480 -0.230427 -0.246023 -0.235361 -0.228754 -0.242586 0.239395 0.230073 0.184780 0.223376 0.210909 0.229026 0.216583 0.226864 0.239087 0.243857 0.259769 0.331347 0.223752 0.226828 0.228667 0.225242 0.222811 0.226224
chargesum: 0.00000
title: Mulliken charges with hydrogens summed into heavy atoms:
elementType: O C C C C C C C C C C C C C C C C
charge: -0.128572 0.020463 -0.073367 0.002863 0.507058 -0.055997 0.501769 -0.179429 -0.203252 -0.197216 -0.123213 -0.017728 -0.003599 -0.017356 -0.010119 -0.005943 -0.016362
polarizability: 1.99075816e+02 -1.98867501e+00 1.81163154e+02 3.35653243e+01 4.23148282e+00 1.15693794e+02
1716.lowfreq: -12.0688 -4.8179 0.0005 0.0007 0.0010 6.4735 20.0091 28.5970 49.7400
frequency: 19.3044 28.2462 49.7283 56.4258 78.1012 155.2658 164.1071 199.6332 216.2735 238.0763 263.7081 282.1199 299.2544 335.2164 396.5454 403.2652 405.0920 410.0228 503.9006 546.5987 554.6228 559.3160 593.0286 616.3547 617.1419 704.4438 707.8779 736.1541 765.2675 771.4118 773.6322 851.6557 857.2970 901.5533 914.9369 921.1910 940.3477 957.5038 974.3771 978.4205 988.4394 990.1034 992.7456 993.8585 996.8195 1025.0133 1027.2775 1050.7691 1070.4214 1084.8682 1091.8512 1112.3808 1156.0621 1171.1878 1171.5760 1183.5508 1185.6932 1189.7707 1208.9381 1223.9079 1273.2678 1297.4980 1312.7810 1321.2641 1335.7999 1352.3091 1379.3186 1384.5391 1390.9380 1400.2210 1441.4312 1443.2916 1454.1652 1474.0765 1475.6289 1485.0892 1486.5670 1591.3395 1595.0651 1611.8048 1615.4913 2955.7733 2966.9075 2975.4521 2995.6528 3033.8210 3071.2276 3080.3496 3113.6505 3114.8022 3117.4750 3125.3691 3131.5006 3138.0282 3141.6556 3152.4194 3161.4432 3164.1305 3551.9212
redmass: 4.6658 3.7695 4.1851 4.3516 4.4974 3.3701 3.5949 4.1367 2.4229 1.2846 2.3968 2.0522 1.4870 3.5047 4.4787 2.8701 2.8892 3.9760 3.7588 2.7415 2.9610 2.8023 4.3590 6.3782 6.3633 1.7542 1.6829 3.5081 2.8974 2.0433 1.9838 1.2521 1.2468 1.6273 1.4691 1.4859 1.9439 4.1608 1.3952 1.3884 3.8821 5.1619 2.1428 1.3203 1.7695 2.3136 2.1394 2.1054 1.9404 1.6693 1.9289 2.0766 1.4623 1.0566 1.0584 1.2534 1.1807 1.1345 1.9994 1.5437 1.2213 1.4768 1.2515 1.3434 1.3635 1.5072 4.3276 3.2486 1.3581 1.8472 2.0801 2.0403 1.1191 1.0506 1.2716 1.9419 1.9850 5.9129 6.1216 6.0893 6.0902 1.0641 1.0847 1.0352 1.0829 1.0978 1.0996 1.0999 1.0857 1.0871 1.0856 1.0876 1.0906 1.0928 1.0957 1.0957 1.1013 1.1003 1.0659
irintensity: 0.0064 0.1178 0.0897 0.1377 0.5281 3.2266 1.1708 3.6225 2.0808 0.2778 6.7613 21.5026 95.6559 9.2362 0.3569 0.2892 0.6624 0.7712 2.3268 34.1443 0.2125 0.7170 14.6782 0.3178 0.0509 103.0786 9.7705 10.4711 5.9756 90.3812 7.6803 0.3730 0.6817 5.5661 16.2398 5.4019 7.9337 41.4461 0.3111 0.4952 7.4493 0.0707 7.2635 0.2769 8.1208 4.1318 8.9601 17.4428 12.0432 2.3440 3.9949 4.1991 62.5100 0.2653 0.7013 5.0872 8.2082 2.0092 5.1164 8.0241 1.3670 5.8460 3.4306 6.9472 3.8732 2.4368 4.8376 3.0841 6.6707 18.1858 4.4219 17.8186 4.8373 12.5128 1.0042 23.2114 9.8272 1.6536 0.3653 8.6290 2.1234 32.6472 30.6736 34.3981 13.7130 39.2203 50.4100 29.5612 11.3944 13.1447 1.1075 2.3429 12.5172 30.8717 40.3618 28.4268 25.4407 16.0058 7.6623
temp: 298.150 k
press: 1.00000 atm
elementType: 8 6 6 6 6 6 6 6 6 6 6 6 6 6 6 6 6 1 1 1 1 1 1 1 1 1 1 1 1 1 1 1 1 1 1
symmnumber: 1
zpe: 770252.2 jmol-1
zpe.correction: 0.293374 hartree
zpe.thermalcorrener: 0.309173 hartree
zpe.thermalcorrenthalpy: 0.310117 hartree
zpe.thermalcorrgfe: 0.248418 hartree
zpe.sumelectzpe: -694.484239 hartree
zpe.sumelectthermal: -694.468439 hartree
zpe.sumelectthermalent: -694.467495 hartree
zpe.sumelectthermalfe: -694.529194 hartree
dipole: -1.7694 -0.2452 0.9352
dipole: 2.0163
quadrupole: -99.6769 -90.1578 -106.0561
quadrupole: 3.1807 10.5880 1.1965
quadrupole: -1.0467 8.4725 -7.4258 3.1807 10.5880 1.1965
hfenergy: -694.7776125 hartree
pointgroup: C01 [X(C16H18O1)]
dipole: 0.7067218 0.1270221 0.337221 debye
polarizability: 196.5294239|-2.9943608|180.6321344|-36.4085414|-7.2741862|118.7712062 unknown
InChI: InChI=1S/C16H18O/c1-13(14-8-4-2-5-9-14)12-16(17)15-10-6-3-7-11-15/h2-11,13,16-17H,12H2,1H3
charge 0 multiplicity 1
35 atoms
O  -1.52251 2.016288 -1.834299
C  0.757955 0.911165 1.120636
C  -0.089233 1.806904 0.175323
C  -0.834425 1.043072 -0.95299
C  1.89684 0.181002 0.400004
C  1.313763 1.754338 2.300783
C  -1.907788 0.105715 -0.419503
C  2.850634 0.886638 -0.380827
C  2.05113 -1.222655 0.535292
C  -1.67388 -1.288254 -0.335827
C  -3.147339 0.625494 0.031086
C  3.919166 0.210947 -1.010753
C  3.120632 -1.904285 -0.089727
C  4.059109 -1.189677 -0.868486
C  -2.656015 -2.15106 0.203446
C  -4.131023 -0.23509 0.565108
C  -3.886973 -1.62624 0.65889
H  0.080921 0.143733 1.544926
H  -0.840307 2.35786 0.774372
H  0.570495 2.570119 -0.290973
H  -0.093556 0.462174 -1.541384
H  1.990562 2.550177 1.937155
H  1.88672 1.121532 3.001844
H  0.49016 2.235465 2.860664
H  2.764464 1.974507 -0.495427
H  1.328526 -1.78395 1.14123
H  -0.727424 -1.701596 -0.705811
H  -3.340737 1.698284 -0.071984
H  -0.854241 2.676353 -2.151375
H  4.644095 0.774812 -1.609259
H  3.220096 -2.989292 0.030128
H  4.888058 -1.714818 -1.356052
H  -2.464964 -3.228922 0.258445
H  -5.089864 0.175167 0.902559
H  -4.65175 -2.293708 1.072185
