program: Gaussian 09
title: 000246516
version: EM64L-G09RevD.01
frameworkgroup: C1[X(C12H12O3)]
method: RPBEPBE
basis: SDD
operation: Freq
keyword: #pfreq=noraman
keyword: PBEPBE/SDD
title: #p freq=noraman PBEPBE/SDD
converged: YES YES NO NO
title: Mulliken charges:
elementType: O O O C C C C C C C C C C C C H H H H H H H H H H H H
charge: -0.255891 -0.239422 -0.206802 0.121859 0.374572 -0.700240 0.409846 -0.356477 -0.373268 0.195778 -0.448310 -0.228333 -0.225950 -0.771819 -0.235275 0.241776 0.229192 0.249786 0.278319 0.252783 0.253514 0.233355 0.228826 0.247674 0.250688 0.241366 0.232452
chargesum: 0.00000
title: Mulliken charges with hydrogens summed into heavy atoms:
elementType: O O O C C C C C C C C C C C C
charge: -0.255891 -0.239422 -0.206802 0.121859 0.374572 0.020514 0.409846 -0.078158 -0.120484 0.195778 -0.194796 0.005022 0.002876 -0.032091 -0.002823
polarizability: 1.38765363e+02 2.68233267e+00 1.50443618e+02 -6.47813910e+00 8.17638433e+00 1.05673526e+02
1716.lowfreq: -5.8810 -0.0007 0.0007 0.0007 7.1642 9.0003 40.6413 65.2690 69.5671
frequency: 40.5853 65.2531 69.5668 124.7526 153.4788 179.1056 202.4099 216.8505 254.8428 275.1997 305.6345 326.8833 376.9074 404.5092 451.5058 459.2806 517.6830 534.9203 561.4197 577.1136 615.3657 637.6082 689.1861 708.4346 745.7142 767.9987 772.7641 800.6735 829.9146 862.9478 872.4399 933.1950 939.2582 987.7451 989.6300 1004.2708 1010.2654 1025.5262 1048.7932 1065.2759 1084.0913 1085.9602 1152.5111 1165.5066 1174.5184 1189.9013 1217.1511 1255.3490 1317.2262 1329.0758 1382.1268 1391.9209 1399.5320 1435.6219 1450.3544 1455.6646 1459.4915 1460.1124 1481.1478 1592.6816 1612.3458 1627.7739 1678.5961 2990.7563 3012.4688 3071.4834 3119.3171 3119.5667 3123.6977 3126.6547 3136.1499 3147.6875 3158.0649 3169.4464 3202.8793
redmass: 3.9634 4.4430 6.0474 1.1653 3.8191 2.8643 1.3308 2.4127 2.6203 3.3206 3.7212 7.4890 6.9831 2.8912 4.5094 6.1400 5.9224 4.1099 4.5139 4.0967 6.4176 5.3281 4.1484 1.8724 5.2198 2.2076 2.9940 3.6576 1.4569 1.2496 5.0399 2.5029 1.8659 1.3731 6.1230 1.3180 1.5290 2.3693 1.5553 1.8448 1.8095 1.8454 4.1588 4.1550 1.0660 1.1510 1.7647 4.1420 1.3357 2.7166 8.6366 1.2358 1.2853 2.2070 1.0451 1.0624 1.0773 1.0619 2.1576 6.2625 6.0358 7.5462 10.3975 1.0376 1.0351 1.0970 1.1003 1.0995 1.1013 1.0850 1.0882 1.0930 1.0960 1.1007 1.0933
irintensity: 0.7824 0.7646 2.8958 0.0326 1.9009 2.1635 0.1382 0.1321 2.0300 0.4727 0.8543 6.0235 0.8044 0.0566 1.2004 2.0278 3.7050 4.2989 10.2837 7.2041 0.1770 8.5860 8.0690 45.3710 8.3914 60.5488 36.7551 37.2887 30.2329 0.8860 16.3019 38.0300 52.8779 0.4696 0.6041 0.6825 32.5037 9.2905 11.6950 9.2738 7.7126 30.2132 163.7040 88.0796 0.8794 2.0731 74.8175 81.3294 5.3398 171.4017 0.2677 31.4940 43.6893 14.6398 17.5511 3.1924 24.3992 3.1530 7.0669 2.0790 0.2252 18.0787 460.4488 7.6388 6.0009 8.6739 7.2316 14.8664 16.3054 0.4937 4.8744 19.2667 16.1130 15.5042 1.1917
temp: 298.150 k
press: 1.00000 atm
elementType: 8 8 8 6 6 6 6 6 6 6 6 6 6 6 6 1 1 1 1 1 1 1 1 1 1 1 1
symmnumber: 1
zpe: 551369.3 jmol-1
zpe.correction: 0.210005 hartree
zpe.thermalcorrener: 0.223600 hartree
zpe.thermalcorrenthalpy: 0.224544 hartree
zpe.thermalcorrgfe: 0.169694 hartree
zpe.sumelectzpe: -689.058364 hartree
zpe.sumelectthermal: -689.044770 hartree
zpe.sumelectthermalent: -689.043826 hartree
zpe.sumelectthermalfe: -689.098676 hartree
dipole: 1.8961 4.8197 -0.1773
dipole: 5.1823
quadrupole: -82.3982 -91.0761 -84.7814
quadrupole: -10.7280 -0.5486 -3.8263
quadrupole: 3.6870 -4.9909 1.3038 -10.7280 -0.5486 -3.8263
hfenergy: -689.2683698 hartree
pointgroup: C01 [X(C12H12O3)]
dipole: -0.8244871 1.8647485 0.0016511 debye
polarizability: 138.7255608|-3.6729155|149.3223177|-6.6978461|-10.3864005|106.8346287 unknown
InChI: InChI=1S/C12H12O3/c1-9-8-11(13)15-12(2,14-9)10-6-4-3-5-7-10/h3-8H,1-2H3
charge 0 multiplicity 1
27 atoms
O  1.182129 1.201761 -0.816245
O  1.196725 -1.24239 -0.835074
O  2.110136 -2.4156 0.934426
C  0.406028 -0.049891 -1.157419
C  -0.919218 -0.032776 -0.383664
C  0.238807 -0.027378 -2.671776
C  1.806416 1.181242 0.429893
C  -1.472283 -1.234933 0.118785
C  -1.64142 1.179571 -0.251616
C  1.783036 -1.298391 0.48954
C  2.028204 0.004478 1.103629
C  -2.728422 -1.219662 0.765889
C  -2.895044 1.191957 0.396994
C  2.211067 2.552128 0.884254
C  -3.442445 -0.008333 0.908219
H  -0.324662 -0.918869 -2.991051
H  -0.318577 0.873515 -2.976241
H  1.228108 -0.030768 -3.156632
H  -0.919486 -2.173146 0.006447
H  -1.215191 2.109268 -0.645101
H  2.498926 0.008938 2.08725
H  -3.14603 -2.152888 1.159191
H  -3.444887 2.133915 0.501983
H  1.318554 3.181298 1.057456
H  2.813846 3.048436 0.101906
H  2.801533 2.502235 1.811912
H  -4.415753 0.001683 1.411248
