program: Gaussian 09
title: 000246503
version: EM64L-G09RevD.01
frameworkgroup: C1[X(C11H15N3O2)]
method: RPBEPBE
basis: SDD
operation: Freq
keyword: #p
keyword: freq=noraman
keyword: PBEPBE/SDD
title: #p freq=noraman PBEPBE/SDD
converged: YES YES NO NO
title: Mulliken charges:
elementType: O O N N N C C C C C C C C C C C H H H H H H H H H H H H H H H
charge: -0.284597 -0.290360 -0.336976 -0.361762 -0.319796 -0.357835 -0.341633 -0.685344 0.439842 0.132035 0.096289 -0.399636 -0.362579 -0.196666 -0.202614 -0.263245 0.253569 0.216032 0.205897 0.222808 0.346522 0.209090 0.228093 0.217118 0.322138 0.363985 0.228470 0.241290 0.225478 0.225330 0.229057
chargesum: 0.00000
title: Mulliken charges with hydrogens summed into heavy atoms:
elementType: O O N N N C C C C C C C C C C C
charge: -0.284597 -0.290360 0.009546 -0.039624 0.044189 0.111766 0.087073 -0.031043 0.439842 0.132035 0.096289 -0.171166 -0.121289 0.028812 0.022716 -0.034189
polarizability: 2.62015471e+02 6.23393274e+00 1.38791463e+02 -3.89243138e+00 1.32525164e+00 8.63350705e+01
1716.lowfreq: -10.8946 -4.2965 -0.0004 0.0003 0.0006 5.1973 7.6673 24.6296 36.7158
frequency: 3.8875 24.4896 36.6781 42.8773 75.7873 83.6244 111.0740 149.9444 201.0184 231.6758 238.1550 250.1325 256.7365 278.6881 358.7424 405.1472 443.1842 448.8065 470.3307 501.5752 524.1493 531.6856 611.1057 618.9175 689.3161 695.3990 711.1043 733.8144 754.4812 758.0677 767.0603 818.4884 826.9657 868.0585 883.8973 893.9742 940.7001 960.7513 981.2523 981.6779 988.0622 1023.5289 1074.3374 1089.6105 1101.6546 1138.5143 1152.4134 1172.0782 1187.6057 1210.2536 1228.4503 1252.3359 1282.9032 1295.1034 1325.5536 1340.8753 1357.3534 1382.3428 1395.0651 1427.7695 1456.9030 1461.8081 1464.2070 1480.0194 1484.6382 1489.4215 1508.7765 1527.7436 1591.4349 1607.0268 1621.2170 1629.4758 2975.5067 2989.6208 2992.3261 3042.7116 3070.9108 3076.2256 3079.0066 3122.6716 3131.0672 3144.0129 3154.6577 3170.0548 3470.3791 3487.9709 3494.9273
redmass: 3.7864 4.9845 4.9298 3.9566 5.1791 3.7656 2.8520 3.4981 4.2369 1.6628 2.8873 5.0351 3.2372 4.0759 2.3126 2.8918 2.4621 2.1434 6.3636 3.1397 6.6704 4.2948 5.3486 4.1417 1.5001 1.4386 1.1150 2.8585 1.7452 3.4702 2.2068 1.9853 1.6636 2.0672 1.5305 2.3299 2.3977 1.3731 4.1196 1.4514 2.2479 2.1789 2.4696 1.7530 2.0535 1.9506 3.6798 1.0494 1.1252 2.1334 1.8413 1.2516 1.2870 2.2668 1.4226 1.3977 1.2733 4.5895 1.2244 2.1549 2.1891 1.1055 1.0751 1.0556 2.1831 1.1172 1.8760 1.7811 6.3026 6.6692 6.6977 8.2994 1.0363 1.0610 1.0646 1.0991 1.0995 1.1015 1.0992 1.0864 1.0866 1.0927 1.0951 1.1014 1.0797 1.0768 1.0757
irintensity: 0.1530 0.6828 0.6217 0.1756 0.6718 5.3837 2.1012 6.4069 7.2278 4.4999 5.6510 10.0904 3.4503 13.5118 26.5635 1.2822 111.8583 43.4645 4.2603 5.7600 5.7378 0.2347 6.7341 9.1896 133.4175 84.1164 118.7935 21.8054 102.1230 5.0430 19.4412 5.8268 6.4740 12.7930 3.3962 23.5132 5.0147 0.1215 1.2602 0.8422 0.2735 5.2591 14.1702 4.5969 4.6613 6.5240 17.0974 1.0226 4.7493 7.2769 33.0151 48.9007 139.0990 78.1293 31.8023 1.0022 1.3705 44.9178 25.5165 52.1632 40.8538 16.2812 6.5089 21.4570 229.5195 7.5268 239.6392 15.2785 138.6594 248.9636 76.2729 98.6930 29.5932 29.0820 40.5191 8.3103 37.7447 53.7657 45.2246 9.5557 1.5599 20.9176 31.5120 17.4562 36.0308 37.9232 68.1081
temp: 298.150 k
press: 1.00000 atm
elementType: 8 8 7 7 7 6 6 6 6 6 6 6 6 6 6 6 1 1 1 1 1 1 1 1 1 1 1 1 1 1 1
symmnumber: 1
zpe: 659824.0 jmol-1
zpe.correction: 0.251314 hartree
zpe.thermalcorrener: 0.267548 hartree
zpe.thermalcorrenthalpy: 0.268493 hartree
zpe.thermalcorrgfe: 0.203096 hartree
zpe.sumelectzpe: -741.680484 hartree
zpe.sumelectthermal: -741.664249 hartree
zpe.sumelectthermalent: -741.663305 hartree
zpe.sumelectthermalfe: -741.728701 hartree
dipole: -1.3612 -0.4530 0.3156
dipole: 1.4689
quadrupole: -72.7937 -95.7630 -99.2694
quadrupole: -0.5516 -2.6722 5.4345
quadrupole: 16.4816 -6.4876 -9.9940 -0.5516 -2.6722 5.4345
hfenergy: -741.9317972 hartree
pointgroup: C01 [X(C11H15N3O2)]
dipole: 0.5483282 -0.0512315 0.1751792 debye
polarizability: 251.586235|35.685854|101.0182837|22.2063644|-13.164197|134.5374855 unknown
InChI: InChI=1S/C11H15N3O2/c1-2-8-12-10(15)11(16)14-13-9-6-4-3-5-7-9/h3-7,12-14H,2,8H2,1H3
charge 0 multiplicity 1
31 atoms
O  1.291207 2.208062 -1.143096
O  0.811978 -0.492948 1.216945
N  2.877138 0.805842 -0.101205
N  -1.831826 0.333869 0.721883
N  -0.717365 0.842434 0.04989
C  4.085166 1.416255 -0.676361
C  4.880078 2.267865 0.343569
C  5.431392 1.453287 1.533684
C  -2.967031 -0.10885 -0.002505
C  1.612395 1.247481 -0.367368
C  0.547757 0.432434 0.376816
C  -4.043454 -0.685092 0.727537
C  -3.079844 0.057058 -1.408396
C  -5.211054 -1.091902 0.053735
C  -4.262963 -0.345789 -2.066319
C  -5.334531 -0.920925 -1.347017
H  3.752482 2.04615 -1.519824
H  4.732043 0.611615 -1.077307
H  5.718082 2.745903 -0.201106
H  4.229404 3.084326 0.709932
H  2.942351 0.026338 0.563942
H  6.087891 0.632442 1.187145
H  6.025105 2.094478 2.209423
H  4.616056 1.009664 2.135007
H  -1.560157 -0.168232 1.574583
H  -0.818385 1.68502 -0.52973
H  -3.963161 -0.80346 1.814894
H  -2.246681 0.468729 -1.987016
H  -6.031313 -1.539553 0.626058
H  -4.339268 -0.216303 -3.15187
H  -6.24679 -1.233394 -1.86522
