program: Gaussian 09
title: 000246498
version: EM64L-G09RevD.01
frameworkgroup: C1[X(C8H12N2O2)]
method: RPBEPBE
basis: SDD
operation: Freq
keyword: #p
keyword: freq=noraman
keyword: PBEPBE/SDD
title: #p freq=noraman PBEPBE/SDD
converged: YES YES NO NO
title: Mulliken charges:
elementType: O O N N C C C C C C C C H H H H H H H H H H H H
charge: -0.283735 -0.276214 -0.067247 -0.339169 -0.329131 -0.423801 -0.338111 -0.690012 0.200856 0.193797 -0.242394 -0.239837 0.191247 0.228715 0.223641 0.273427 0.207997 0.192969 0.211441 0.222108 0.217864 0.341263 0.261962 0.262364
chargesum: 0.00000
title: Mulliken charges with hydrogens summed into heavy atoms:
elementType: O O N N C C C C C C C C
charge: -0.283735 -0.276214 -0.067247 0.002094 0.090831 0.073267 0.062855 -0.038599 0.200856 0.193797 0.019568 0.022527
polarizability: 1.33605900e+02 -1.03815162e+01 1.20300356e+02 -1.10368128e+01 -3.72244777e+00 6.88662440e+01
1716.lowfreq: -0.0010 -0.0010 -0.0005 2.3142 6.5558 11.0530 32.2954 52.0526 69.1690
frequency: 32.1934 52.0294 69.1310 105.0371 110.6965 172.9139 222.5277 230.2747 275.4640 305.4049 314.3930 394.1427 419.2620 470.5149 488.5679 507.5877 587.4901 604.4216 711.0614 716.0115 737.3021 776.1548 811.6544 844.7853 894.2059 905.6580 931.6618 986.6369 1008.3393 1054.3817 1071.5222 1112.4482 1122.5830 1152.8538 1200.6550 1238.9153 1270.6073 1272.6964 1291.2784 1295.6050 1331.4325 1350.5410 1353.6232 1365.7550 1392.8185 1440.1182 1470.9864 1473.7710 1476.7002 1478.3458 1489.4601 1543.7699 1595.0929 1663.1175 2968.1856 2977.2770 2978.6620 2985.1285 3015.1329 3047.4132 3074.5872 3079.2133 3085.1210 3164.1822 3186.9101 3535.8679
redmass: 3.9803 4.1766 1.6013 8.0678 2.4186 3.7140 1.1329 5.0217 4.7702 3.0167 4.1412 5.6440 3.6269 9.9312 1.2740 4.6028 4.5830 2.5871 6.4348 6.6047 1.0869 1.6773 2.2886 1.7324 2.5708 1.9387 1.3817 1.2794 4.0742 2.2079 2.5525 2.3137 1.5081 2.7430 1.9052 1.8195 1.5286 1.3251 1.1603 2.1580 1.5565 1.4992 2.1019 1.3798 1.2106 1.2809 1.0700 1.5436 1.0468 1.1223 1.0936 8.5347 5.8410 6.8023 1.0595 1.0512 1.0473 1.0672 1.0973 1.0995 1.1004 1.0995 1.0989 1.0878 1.1001 1.0790
irintensity: 0.2592 0.1022 0.0026 10.5321 0.1282 0.0437 0.0189 1.3436 5.0718 1.6120 2.1876 16.6645 3.6657 1.4396 89.7525 2.0185 5.5992 25.8925 3.1108 2.2326 9.4336 3.2480 7.4455 58.0347 20.5854 3.9193 0.8351 0.0254 4.5936 13.9451 0.3534 20.1485 14.6701 61.5597 7.1450 35.9129 12.8027 0.8754 8.7151 15.9252 6.0475 2.4212 33.0807 0.2698 10.5568 32.0902 0.9883 5.5777 12.4158 3.8199 21.9678 25.1429 528.9323 41.1959 18.8454 14.1224 38.5922 55.8329 7.6767 18.3211 56.7715 47.5289 14.8254 0.1306 3.9343 46.9574
temp: 298.150 k
press: 1.00000 atm
elementType: 8 8 7 7 6 6 6 6 6 6 6 6 1 1 1 1 1 1 1 1 1 1 1 1
symmnumber: 1
zpe: 510161.1 jmol-1
zpe.correction: 0.194310 hartree
zpe.thermalcorrener: 0.206684 hartree
zpe.thermalcorrenthalpy: 0.207629 hartree
zpe.thermalcorrgfe: 0.154429 hartree
zpe.sumelectzpe: -571.063448 hartree
zpe.sumelectthermal: -571.051074 hartree
zpe.sumelectthermalent: -571.050130 hartree
zpe.sumelectthermalfe: -571.103329 hartree
dipole: -2.7731 -0.5434 0.6780
dipole: 2.9061
quadrupole: -69.0535 -88.8392 -70.1743
quadrupole: 12.7021 -3.4201 -2.3598
quadrupole: 6.9688 -12.8169 5.8481 12.7021 -3.4201 -2.3598
hfenergy: -571.2577583 hartree
pointgroup: C01 [X(C8H12N2O2)]
dipole: -1.0857041 -0.2666059 0.2395312 debye
dipolederiv: -0.540948 0.3933045 0.0436905 0.0854314 -1.1286568 -0.0368058 0.0486665 -0.0993637 -0.3792295 -0.7082036 0.2485333 0.0801773 0.6081866 -1.0738756 -0.1362844 0.084677 -0.0471508 -0.4009149 -0.6184641 -0.4213001 0.0596502 0.3401415 -0.4231145 -0.1079822 0.0953441 0.2054231 -0.1857339 -0.5738108 0.3793284 0.0545741 -0.501001 -0.3091431 0.124434 0.0728482 -0.1553988 -0.3049892 -0.0859496 -0.0471618 0.0143781 -0.0547378 0.1499214 0.0044956 0.0633861 0.0202787 -0.0112284 0.5745632 0.1199153 -0.043179 0.0472881 0.0586147 -0.0536484 -0.1217738 -0.117722 0.2879473 0.0908491 -0.0139191 -0.0281454 -0.0391936 0.1578496 -0.0325394 -0.1348457 -0.0531969 0.0976744 -0.0572308 -0.031703 -0.0458428 -0.0198364 0.0856666 -0.0149504 0.007832 -0.0048237 0.028555 0.4624544 -0.2165703 -0.0929771 -0.1768819 1.4883174 0.043913 -0.0445335 -0.0067674 0.2236866 0.9618969 -0.5806598 -0.2016491 -0.5995472 1.1809572 0.1212994 -0.22753 0.1595657 0.3016364 -0.0289538 0.1618941 -0.0199221 0.0806382 0.0543529 -0.0393058 -0.0370837 -0.0603467 -0.0898308 0.1020142 -0.0376634 -0.0781292 0.1276869 -0.2137733 -0.015172 -0.0728698 0.0123207 -0.0840738 0.0152166 0.0624088 0.0235086 0.0722857 -0.1029002 -0.102448 0.01131 -0.0673555 0.0201897 0.0581805 -0.0203427 0.0070992 -0.0132191 -0.0109636 0.1035424 0.0169217 0.0755225 -0.0496994 -0.0028367 -0.0124903 -0.0032539 -0.043904 -0.0086187 0.1569503 0.0091688 0.0940671 -0.0513093 0.0617204 0.0007203 0.0091764 0.0701446 0.0279664 -0.0788955 -0.0084012 -0.0153395 0.0846521 0.028082 0.0136 0.0096978 0.0533565 -0.112811 -0.1211897 0.0283287 -0.0930321 0.0116915 0.0284868 0.008001 -0.0251941 -0.0186953 -0.0327006 0.1466577 0.011875 0.1207297 -0.1032102 0.0762215 0.0840102 0.0240624 0.0315969 -0.1171265 -0.1098674 -0.0148443 -0.0852259 0.0298203 -0.2134972 -0.0309252 0.0475098 -0.0265306 0.09839 -0.0049667 0.0668932 -0.0034416 0.0546681 0.096895 -0.0322211 0.015664 0.0000366 -0.0335024 0.1376956 -0.0331282 0.1035311 -0.0636525 0.2163191 0.0084963 0.0622361 0.0135808 0.1749552 -0.00802 0.0859386 -0.0069571 0.301153 0.0641472 -0.0208705 0.0284812 -0.0687449 0.0007736 0.0294303 0.0328948 0.0175433 0.1433713 -0.0071523 -0.0143849 0.0583872 0.0319181 0.0894214 -0.0063424 0.0589255 0.0071398 0.1388263 unknown
polarizability: 133.9435877|-8.6868085|120.0821328|-12.3160181|2.3607543|68.7467795 unknown
InChI: InChI=1S/C8H12N2O2/c1-2-3-6-10-8(12)5-4-7(11)9-10/h4-5,9H,2-3,6H2,1H3
charge 0 multiplicity 1
24 atoms
O  0.147823 2.531312 0.318759
O  2.700333 -2.294248 -0.325541
N  0.177329 0.203491 0.475399
N  0.857436 -1.016707 0.272663
C  -2.204492 -0.261012 -0.22727
C  -1.229927 0.117303 0.912779
C  -3.662844 -0.344396 0.278131
C  -4.655558 -0.706684 -0.847147
C  0.782809 1.436822 0.174614
C  2.172242 -1.146524 -0.193205
C  2.176517 1.337805 -0.307104
C  2.824001 0.145381 -0.486846
H  -1.913075 -1.232465 -0.676883
H  -2.128192 0.499951 -1.02685
H  -1.298307 -0.609692 1.747191
H  -1.477636 1.118754 1.303369
H  -3.949987 0.628159 0.725692
H  -3.732721 -1.097096 1.090252
H  -4.412871 -1.689643 -1.292641
H  -5.691762 -0.755059 -0.466619
H  -4.62762 0.045841 -1.656818
H  0.343928 -1.865912 0.522663
H  2.656942 2.297003 -0.522473
H  3.85373 0.087417 -0.851314
