program: Gaussian 09
title: 000246492
version: EM64L-G09RevD.01
frameworkgroup: C1[X(C18H24O2)]
method: RPBEPBE
basis: SDD
operation: Freq
keyword: #pfreq=noraman
keyword: PBEPBE/SDD
title: #p freq=noraman PBEPBE/SDD
converged: YES YES NO NO
title: Mulliken charges:
elementType: O O C C C C C C C C C C C C C C C C C C H H H H H H H H H H H H H H H H H H H H H H H H
charge: -0.234182 -0.197435 -0.070484 -0.227577 -0.237847 -0.467558 0.539820 -0.629327 -0.471498 -0.438498 0.438327 -0.542801 -0.576701 -0.563138 0.181158 -0.726167 -0.367070 -0.526451 -0.544455 0.179007 0.208527 0.237859 0.206630 0.218818 0.228115 0.217826 0.240083 0.216905 0.222666 0.221186 0.223620 0.244556 0.224948 0.257769 0.236902 0.226441 0.219655 0.220737 0.218205 0.224070 0.227710 0.249052 0.237916 0.252682
chargesum: 0.00000
title: Mulliken charges with hydrogens summed into heavy atoms:
elementType: O O C C C C C C C C C C C C C C C C C C
charge: -0.234182 -0.197435 0.138043 0.010281 -0.031217 -0.020625 0.539820 -0.171418 -0.031927 0.006308 0.438327 -0.073298 -0.318932 -0.099795 0.181158 -0.063155 -0.147414 -0.049689 -0.053857 0.179007
polarizability: 2.58991429e+02 -8.41599352e+00 1.65731196e+02 8.63684570e+00 4.88360249e-01 1.58084467e+02
1716.lowfreq: -16.3274 -11.9468 -0.0007 -0.0001 0.0003 6.7151 9.0345 28.9784 43.4184
frequency: -14.2852 28.8936 43.3596 56.6482 86.8235 96.9078 119.5242 153.8199 169.8333 174.8729 194.0424 214.7747 223.3830 251.7438 261.6585 298.3576 320.1220 369.4503 384.5565 400.5742 423.5237 443.6095 462.4940 470.6659 478.8215 513.6193 526.0246 547.9175 555.2638 572.0402 627.3684 677.3810 717.2900 748.8185 756.0492 768.4522 787.0042 811.6379 813.5036 824.3792 863.0695 891.6421 896.0095 898.7561 922.2977 937.1020 969.3278 971.8702 989.5875 1008.9093 1013.7774 1022.1995 1029.8117 1053.5899 1069.5385 1076.0672 1090.6484 1114.2505 1119.6119 1127.0175 1136.8093 1142.5369 1159.2784 1179.9599 1186.2948 1192.1145 1206.3457 1212.6221 1219.2865 1244.4373 1261.5811 1267.1362 1272.8175 1274.7543 1285.7632 1293.6110 1299.7401 1312.7430 1317.0290 1322.9170 1328.4921 1341.0473 1346.4245 1350.5790 1351.8498 1355.6209 1375.2817 1395.3366 1427.5598 1441.8684 1443.6546 1453.6610 1460.2963 1464.7189 1466.5059 1481.2472 1484.5986 1491.3252 1587.7830 1629.3454 1638.7392 1682.7366 2911.8400 2941.2534 2945.8301 2947.3039 2954.7202 2960.8807 2970.8548 2975.8421 2979.2332 2981.2017 2982.8756 2996.5281 3010.3476 3017.3076 3034.9211 3038.0279 3045.1763 3049.6387 3067.3599 3073.4670 3073.7218 3079.7163 3094.8238 3121.4096
redmass: 3.6055 6.5242 6.0332 3.6102 2.5802 3.5412 3.7179 2.2794 3.2112 2.8220 2.4649 2.9879 1.5933 2.7665 2.4450 2.2010 2.7516 2.8874 2.4319 2.8721 3.4001 4.3823 3.6853 3.6472 3.1669 2.6849 3.1121 2.8269 2.8033 3.9575 3.2426 3.9615 3.6054 2.1893 1.7311 1.5684 1.7924 1.8720 2.1676 2.0282 2.4924 2.1257 1.7816 1.4998 2.1720 2.2041 1.9883 1.9512 2.2257 1.7067 2.1385 2.0890 2.1353 2.0332 2.3717 1.9508 2.3073 1.9222 1.3153 1.9226 1.9228 1.6583 1.6632 1.7048 1.4156 1.7838 1.3443 1.5200 1.3880 1.5242 1.4654 1.5729 1.3457 1.2792 1.3717 1.3897 1.4981 1.6991 1.3902 1.4580 1.4196 1.5075 1.4886 1.8764 1.4408 1.7595 1.6731 1.2171 1.0796 1.0890 1.0822 1.0902 1.0864 1.0880 1.0861 1.0461 1.0487 1.0738 9.8622 7.7672 9.8511 6.6137 1.0790 1.0798 1.0667 1.0665 1.0668 1.0795 1.0675 1.0652 1.0576 1.0406 1.0600 1.0623 1.0958 1.0908 1.0995 1.0945 1.1019 1.0981 1.0951 1.0984 1.0996 1.0969 1.0905 1.0914
irintensity: 1.1269 3.9155 3.3333 1.7649 1.2412 1.2349 1.0553 1.8405 0.1315 3.3218 0.4117 0.4048 0.3819 1.5645 3.1371 0.0355 1.6940 2.2095 4.0360 1.3113 0.3352 3.6316 7.1944 5.5351 0.4888 0.4266 1.3072 7.2805 6.3081 2.0046 1.2802 0.7545 0.6464 18.1741 1.9205 7.2726 10.6488 7.0175 1.8508 9.8572 3.5269 2.8961 6.7573 25.9526 8.9439 1.8151 7.3696 14.7047 3.7269 1.4090 4.9081 2.7722 2.2691 8.6635 7.0290 3.2289 1.9331 14.8403 1.9269 2.2334 1.7125 5.2395 7.0345 13.2969 8.3112 21.3883 4.7637 32.2698 2.3373 10.6273 4.3236 42.4393 1.3306 15.9924 2.7473 2.0320 0.0684 2.6389 4.4744 9.4153 3.4597 1.8941 7.6744 15.1076 0.6934 7.7409 4.6141 24.3493 19.5784 18.6992 13.8842 15.2867 10.4920 5.8054 12.6247 1.2825 5.8699 12.8428 174.4213 210.0534 172.7171 1.2193 5.2911 2.1856 20.2595 21.7284 6.3908 51.8965 9.8708 13.4149 18.9761 30.9204 53.3647 37.8161 22.3075 8.3528 7.5671 38.2232 28.4656 34.5532 21.5662 46.5470 69.3905 26.3728 27.8768 9.8147
temp: 298.150 k
press: 1.00000 atm
elementType: 8 8 6 6 6 6 6 6 6 6 6 6 6 6 6 6 6 6 6 6 1 1 1 1 1 1 1 1 1 1 1 1 1 1 1 1 1 1 1 1 1 1 1 1
symmnumber: 1
zpe: 989796.3 jmol-1
zpe.correction: 0.376994 hartree
zpe.thermalcorrener: 0.395219 hartree
zpe.thermalcorrenthalpy: 0.396163 hartree
zpe.thermalcorrgfe: 0.330694 hartree
zpe.sumelectzpe: -849.227757 hartree
zpe.sumelectthermal: -849.209532 hartree
zpe.sumelectthermalent: -849.208587 hartree
zpe.sumelectthermalfe: -849.274057 hartree
dipole: -1.7717 -0.0407 -2.6723
dipole: 3.2065
quadrupole: -185.3480 -115.7347 -116.9032
quadrupole: 16.4186 -3.1822 1.4001
quadrupole: -46.0194 23.5940 22.4254 16.4186 -3.1822 1.4001
hfenergy: -849.6047506 hartree
pointgroup: C01 [X(C18H24O2)]
dipole: -0.6937113 -0.0885853 1.0499419 debye
polarizability: 259.0685953|8.5546217|165.4083512|-8.0863624|1.299425|158.330145 unknown
InChI: InChI=1S/C18H24O2/c1-2-16-17(12-3-6-14(19)7-4-12)9-5-13-11-15(20)8-10-18(13)16/h3,11,16-18H,2,4-10H2,1H3
charge 0 multiplicity 1
44 atoms
O  5.765226 0.77332 -0.842984
O  -5.945574 -0.305815 -0.790326
C  0.389943 -0.622646 -0.169854
C  1.881803 -0.593983 0.326833
C  -0.538738 0.275567 0.71079
C  0.012408 1.727001 0.76725
C  2.384316 0.831115 0.551002
C  1.459258 1.761755 1.309898
C  2.798354 -1.381369 -0.647325
C  -0.147529 -2.078425 -0.302129
C  -2.004513 0.290305 0.254861
C  4.301801 -1.143223 -0.39356
C  3.624739 1.250635 0.141592
C  -3.055886 -0.033033 1.309847
C  4.646481 0.345432 -0.422867
C  -0.125894 -2.922167 0.994171
C  -2.368463 0.595694 -1.02127
C  -4.456057 0.535361 0.958215
C  -3.796534 0.582209 -1.536433
C  -4.841086 0.212812 -0.47983
H  0.390228 -0.18225 -1.191699
H  1.901642 -1.096876 1.321634
H  -0.509682 -0.125024 1.747509
H  -0.641473 2.354092 1.403459
H  -0.017963 2.162544 -0.250452
H  1.437644 1.439016 2.374149
H  1.857719 2.792718 1.299284
H  2.555939 -1.072731 -1.684711
H  2.582738 -2.462719 -0.576231
H  0.427683 -2.608538 -1.084738
H  -1.186198 -2.022434 -0.679447
H  4.930326 -1.670464 -1.132303
H  4.582812 -1.531725 0.60802
H  3.934664 2.294772 0.279603
H  -3.119759 -1.133982 1.44337
H  -2.73695 0.370583 2.291252
H  -1.59625 0.835629 -1.766243
H  0.901444 -3.078796 1.372466
H  -0.713546 -2.451905 1.804151
H  -0.561636 -3.920649 0.808245
H  -4.414486 1.640636 1.051198
H  -5.238436 0.159411 1.63892
H  -4.071537 1.58138 -1.941681
H  -3.910881 -0.11624 -2.388632
