program: Gaussian 09
title: 000246485
version: EM64L-G09RevD.01
frameworkgroup: C1[X(C19H28O3)]
method: RPBEPBE
basis: SDD
operation: Freq
keyword: #pfreq=noraman
keyword: PBEPBE/SDD
title: #p freq=noraman PBEPBE/SDD
converged: YES YES NO NO
title: Mulliken charges:
elementType: O O O C C C C C C C C C C C C C C C C C C C H H H H H H H H H H H H H H H H H H H H H H H H H H H H
charge: -0.431233 -0.180963 -0.196178 -0.135521 -0.143268 -0.108180 0.423629 0.385053 -0.530823 -0.525648 -0.234659 -0.538468 -0.208036 -0.620918 -0.474863 -0.496826 0.123926 -0.863589 -0.842062 -0.593354 -0.553313 0.180103 0.215721 0.259129 0.196807 0.216993 0.220999 0.198750 0.226870 0.245481 0.218402 0.229146 0.245586 0.258135 0.229333 0.210640 0.228402 0.220983 0.226084 0.227839 0.234081 0.236176 0.242924 0.223559 0.230657 0.254369 0.260179 0.246698 0.230166 0.331076
chargesum: 0.00000
title: Mulliken charges with hydrogens summed into heavy atoms:
elementType: O O O C C C C C C C C C C C C C C C C C C C
charge: -0.100157 -0.180963 -0.196178 0.080200 0.115861 0.088627 0.423629 0.385053 -0.092831 -0.100028 0.010823 -0.090920 0.037550 -0.133449 -0.035821 -0.049758 0.123926 -0.165491 -0.144923 -0.078806 -0.076449 0.180103
polarizability: 2.48830345e+02 -6.20312152e-01 1.91674334e+02 -4.15633563e+00 9.60301679e-01 1.60091910e+02
1716.lowfreq: -13.4015 -0.0003 0.0002 0.0005 6.5016 14.0787 37.9339 53.9396 69.9116
frequency: 37.4985 53.8978 69.9056 92.0498 108.9987 120.6760 132.9944 141.0474 174.9951 195.5224 206.6983 210.7875 230.9667 244.0279 256.5278 272.3051 282.3806 307.2400 320.5221 328.9012 347.9477 370.3881 385.6640 390.5774 406.5000 429.1309 447.4561 463.3535 490.3064 504.3340 509.7068 538.3852 550.8632 589.2484 610.4812 630.3493 651.0869 689.9057 707.5421 740.7961 763.8471 797.1736 817.0469 824.8073 827.7990 867.4653 873.1057 902.2697 919.3541 922.5647 932.9187 951.6257 960.8090 979.0079 985.5959 991.4190 1005.6587 1016.5111 1017.6095 1031.7705 1033.2227 1054.7181 1066.4146 1085.1953 1088.5630 1095.7741 1105.3873 1123.4270 1125.7133 1141.0252 1150.4234 1159.8275 1169.0045 1186.4880 1202.9388 1206.0641 1216.6209 1221.5755 1234.2529 1238.9908 1245.3219 1250.6369 1260.3009 1266.6375 1273.5863 1278.8588 1282.9535 1289.1574 1298.3095 1301.4344 1311.1073 1321.2912 1326.6114 1333.0124 1333.6920 1337.6625 1347.4281 1355.5717 1360.8146 1383.7234 1389.7322 1399.1111 1439.2608 1444.6487 1447.7106 1459.3435 1464.5129 1465.0421 1470.3643 1478.6903 1483.2141 1488.1044 1488.9143 1496.3035 1627.1672 1632.2020 2902.4584 2909.7403 2945.0784 2960.3382 2960.7076 2968.5385 2975.1929 2978.8651 2983.3512 2985.5790 2986.4072 2993.5645 2996.0855 3000.9601 3020.3089 3029.9493 3035.8123 3044.9188 3049.6675 3063.6337 3068.0739 3069.8296 3075.2055 3078.7923 3081.6811 3082.1898 3083.6180 3553.7663
redmass: 5.9698 4.1862 5.1788 4.3470 2.7810 4.4926 1.6651 1.5185 1.9705 1.8793 2.4849 4.0812 2.0286 3.2490 2.7086 2.8824 3.9357 2.7200 2.4274 1.1496 3.3718 2.2417 2.6921 3.2577 3.2325 2.3503 3.0273 3.1652 3.5461 2.7384 2.8888 2.9020 3.7458 3.0495 2.9472 3.4188 4.1214 3.1090 2.2948 2.5187 2.3819 3.0841 1.9949 1.9573 1.8359 1.8326 1.9696 2.2554 2.1029 1.8643 1.9322 2.1001 2.2408 2.0231 2.4106 2.3816 2.3292 2.0063 1.9152 2.8798 2.3043 1.9959 2.4019 2.0459 1.7118 1.4127 2.3110 2.1568 2.1281 1.6429 2.0627 1.6142 1.8272 1.9677 1.3664 1.7450 1.7446 2.0195 1.7726 1.4834 1.3780 1.4733 1.8696 1.3412 1.4039 1.8161 1.4183 1.3845 1.4295 1.3779 1.4185 1.4076 1.4459 1.4552 1.4203 1.5613 1.4985 1.4569 1.4027 1.2055 1.2251 1.2000 1.0797 1.0938 1.0784 1.0736 1.0829 1.0829 1.0821 1.0798 1.0609 1.0526 1.0676 1.0597 9.5595 9.4316 1.0816 1.0802 1.0799 1.0633 1.0668 1.0629 1.0639 1.0394 1.0751 1.0617 1.0627 1.0439 1.0627 1.0652 1.0861 1.0965 1.0993 1.1004 1.1001 1.0987 1.0956 1.0961 1.1003 1.0963 1.0989 1.0967 1.0965 1.0656
irintensity: 1.4222 4.3388 1.7649 4.2714 1.2556 0.5702 1.1736 1.0923 1.1863 1.2864 3.7120 0.3825 1.2929 3.6366 0.7522 4.0106 1.4830 3.7282 2.8122 119.7892 3.1801 5.0890 1.3437 7.4524 0.7897 1.3081 0.2001 7.3837 10.8573 5.5069 0.9611 2.2556 1.5927 2.6508 4.8807 6.9344 3.3559 4.9862 0.9745 4.7875 1.9954 0.8549 1.4214 2.5390 2.9279 4.1499 3.1455 5.2917 5.8934 1.1664 14.6877 3.0720 9.2803 15.1937 21.1502 2.2746 65.9347 24.3209 9.5370 14.3744 33.5727 1.4166 4.8637 2.0462 26.0964 0.2366 0.8551 8.0503 3.9416 6.7558 6.9397 2.5765 21.2500 1.0688 17.9074 2.7030 13.3773 2.8349 81.9629 13.1422 3.0373 2.8998 32.5927 5.1725 8.5927 4.7405 1.6233 6.1803 1.7653 0.6643 7.2907 4.4026 3.2939 9.2807 0.3737 5.6107 0.1832 0.3542 9.2767 24.4846 20.3616 25.3541 22.9105 10.4172 21.2849 1.3407 4.7276 9.7547 6.1725 6.3622 11.3423 2.5315 11.1775 6.4758 148.4870 237.8494 3.5654 29.0445 9.4738 37.3581 8.8427 25.2286 15.4842 11.3081 16.2834 23.8745 28.5542 26.0012 20.4302 41.0517 18.6670 15.7579 63.3814 38.3325 7.9038 33.3214 22.9593 22.1672 57.9814 18.2331 22.9994 43.4418 15.8100 7.6673
temp: 298.150 k
press: 1.00000 atm
elementType: 8 8 8 6 6 6 6 6 6 6 6 6 6 6 6 6 6 6 6 6 6 6 1 1 1 1 1 1 1 1 1 1 1 1 1 1 1 1 1 1 1 1 1 1 1 1 1 1 1 1
symmnumber: 1
zpe: 1137963.8 jmol-1
zpe.correction: 0.433428 hartree
zpe.thermalcorrener: 0.454288 hartree
zpe.thermalcorrenthalpy: 0.455233 hartree
zpe.thermalcorrgfe: 0.385793 hartree
zpe.sumelectzpe: -964.787195 hartree
zpe.sumelectthermal: -964.766334 hartree
zpe.sumelectthermalent: -964.765390 hartree
zpe.sumelectthermalfe: -964.834830 hartree
dipole: -4.1042 -1.4254 1.2100
dipole: 4.5100
quadrupole: -172.2309 -142.2881 -131.2478
quadrupole: -15.9145 0.8642 -7.5646
quadrupole: -23.6420 6.3008 17.3412 -15.9145 0.8642 -7.5646
hfenergy: -965.2206228 hartree
pointgroup: C01 [X(C19H28O3)]
dipole: 1.6150861 0.5604812 0.4751984 debye
polarizability: 248.7952439|-0.7719424|191.6526335|4.4696318|-1.343973|160.1487111 unknown
InChI: InChI=1S/C19H28O3/c1-18-7-5-11(20)9-15(18)16(21)10-12-13-3-4-17(22)19(13,2)8-6-14(12)18/h12-15,17,22H,3-10H2,1-2H3
charge 0 multiplicity 1
50 atoms
O  5.415041 1.155617 -0.255324
O  -2.039344 -2.857479 0.845544
O  -5.590576 0.428567 -1.103357
C  2.119134 -0.634456 -0.416883
C  0.699827 -0.698029 0.181054
C  -0.085221 0.589976 -0.238063
C  2.923774 0.615608 0.051139
C  -1.573472 0.578983 0.288829
C  0.702736 1.884714 0.120321
C  2.16346 1.878255 -0.41063
C  4.275425 0.337985 -0.683592
C  3.096546 -1.821368 -0.206396
C  -2.269574 -0.709234 -0.314773
C  -0.045052 -1.98823 -0.274841
C  4.501222 -1.204755 -0.521572
C  -2.343883 1.815747 -0.266256
C  -1.508994 -1.956391 0.141779
C  3.178061 0.657941 1.580554
C  -1.631592 0.565784 1.839911
C  -3.783721 -0.804867 -0.01938
C  -3.874843 1.778936 -0.009301
C  -4.518422 0.462071 -0.441422
H  1.988339 -0.518753 -1.519337
H  0.782963 -0.731059 1.286379
H  -0.155201 0.560763 -1.351999
H  0.712598 2.030328 1.217856
H  0.180458 2.762391 -0.304013
H  2.146096 1.902783 -1.520729
H  2.687736 2.795261 -0.079418
H  4.165593 0.606457 -1.750621
H  2.863145 -2.677429 -0.86317
H  3.045921 -2.189476 0.835962
H  -2.128809 -0.633275 -1.416046
H  0.431853 -2.891712 0.141675
H  0.005667 -2.048304 -1.383055
H  5.217423 -1.394433 0.301964
H  4.950578 -1.63341 -1.433634
H  -2.165071 1.884447 -1.359262
H  -1.939096 2.741606 0.183333
H  3.727375 -0.232022 1.94035
H  3.772238 1.555528 1.83422
H  2.242028 0.714306 2.160384
H  -1.150371 -0.330445 2.268762
H  -1.126729 1.456201 2.255027
H  -2.670989 0.576609 2.210599
H  -3.933465 -0.977778 1.064854
H  -4.229715 -1.671419 -0.535991
H  -4.383448 2.608306 -0.531006
H  -4.070655 1.908486 1.075318
H  5.705398 0.850966 0.641855
