program: Gaussian 09
title: 000246518
version: EM64L-G09RevD.01
frameworkgroup: C1[X(C24H27O4P)]
method: RPBEPBE
basis: SDD
operation: Freq
keyword: #p
keyword: freq=noraman
keyword: PBEPBE/SDD
title: #p freq=noraman PBEPBE/SDD
converged: YES YES NO NO
title: Mulliken charges:
elementType: P O O O O C C C C C C C C C C C C C C C C C C C C C C C C H H H H H H H H H H H H H H H H H H H H H H H H H H H
charge: 1.299655 -0.530421 -0.547584 -0.521339 -0.567965 0.402696 0.408586 0.503545 0.496878 0.497604 0.496386 0.498335 0.354060 -0.533449 -0.495057 -0.493273 -0.580219 -0.585172 -0.586134 -0.581360 -0.382908 -0.379804 -0.326481 -0.363314 -0.807538 -0.807052 -0.809460 -0.808632 -0.669096 0.210175 0.209738 0.290132 0.287630 0.264474 0.265366 0.235691 0.235738 0.234621 0.235755 0.273159 0.254455 0.233781 0.227921 0.227247 0.233067 0.227144 0.229449 0.233933 0.234355 0.221258 0.235270 0.221703 0.233255 0.223006 0.216494 0.223691
chargesum: 0.00000
title: Mulliken charges with hydrogens summed into heavy atoms:
elementType: P O O O O C C C C C C C C C C C C C C C C C C C C C C C C
charge: 1.299655 -0.530421 -0.547584 -0.521339 -0.567965 0.402696 0.408586 0.503545 0.496878 0.497604 0.496386 0.498335 0.354060 -0.113536 -0.204925 -0.205642 -0.315744 -0.319806 -0.350442 -0.345621 -0.148287 -0.144049 -0.053323 -0.108859 -0.118588 -0.117391 -0.119913 -0.118404 -0.005906
polarizability: 3.27850040e+02 3.92488787e-01 3.37460153e+02 -1.92295978e+01 -2.80067204e+00 2.63452108e+02
1716.lowfreq: -41.4460 -10.8487 -6.5287 -4.5128 -0.0010 -0.0010 -0.0008 2.0337 4.6978
frequency: -41.4391 -10.0754 -5.1951 9.0062 11.4133 13.1376 16.2336 21.4256 24.1644 36.8107 43.1742 56.1829 77.0845 87.3290 108.8607 138.0161 143.8588 169.6186 197.2775 198.0836 207.4838 208.2277 213.5885 220.3016 220.6969 229.9951 261.2484 267.5033 273.9837 292.2951 316.9914 346.1941 374.0816 402.8630 411.5000 417.4371 447.8275 450.7526 480.3020 500.4735 501.0900 513.8588 517.5222 522.4034 523.6648 544.6794 547.6687 559.9005 582.3263 588.9763 610.2680 636.7051 692.2893 693.4701 697.8691 728.8110 747.4928 762.6458 786.0378 833.3409 834.6507 845.0136 866.4539 869.4793 881.8579 883.7660 908.2244 909.8400 926.7377 934.9478 948.9143 949.8376 954.0901 968.2969 969.8801 984.8933 985.3861 1008.1861 1012.3102 1016.9924 1018.9867 1019.8224 1042.7753 1044.0776 1046.6920 1046.7961 1051.5679 1051.9880 1062.6609 1117.4370 1128.6780 1132.8187 1152.7625 1174.0055 1174.7188 1187.0814 1216.0455 1241.5409 1283.6671 1284.7778 1292.7198 1296.7969 1302.1292 1311.8633 1378.6282 1378.9291 1379.9369 1389.0899 1396.4254 1396.6320 1398.1203 1398.9355 1408.7206 1426.0110 1427.4114 1454.3508 1454.5959 1469.2055 1469.6157 1470.7408 1470.7772 1471.2311 1473.8662 1483.3700 1484.1466 1484.3251 1485.0142 1488.7136 1493.3334 1591.8987 1594.5631 1598.1217 1612.3789 1620.8857 1621.2387 2977.8515 2978.5795 2979.0013 2979.2314 2979.8099 2987.2386 3037.8984 3057.3028 3057.3730 3058.7961 3058.8789 3078.8245 3084.3358 3086.4429 3086.6853 3087.8149 3088.5252 3118.7256 3119.7372 3125.1389 3127.7891 3147.2719 3149.6730 3159.0074 3162.0641 3162.4175 3170.7161
redmass: 1.0188 2.1630 1.3498 3.2365 4.5126 1.4690 2.1484 4.2970 3.8727 2.5057 1.0369 4.8545 5.4655 5.7100 5.7932 4.7764 4.8893 3.9188 3.4764 3.4924 2.5505 4.1904 1.7103 3.0216 3.0496 4.8615 3.0998 3.6651 4.1708 5.0207 3.4110 3.9601 5.3381 4.3561 3.0031 4.3739 4.5370 4.7018 5.1284 5.1934 5.2393 5.1664 5.0257 3.0220 3.1456 4.7038 4.1332 3.1152 4.9709 5.1956 6.8116 6.8513 2.3396 2.1734 5.8487 3.7170 12.6758 4.8204 1.1624 4.7521 1.4009 1.5621 1.4101 1.4153 1.3059 1.3036 1.4172 1.4192 3.2337 2.7921 3.4768 3.4973 1.3506 2.1515 1.4420 5.0530 4.9779 2.8019 1.8641 1.9723 1.5239 1.5215 2.6448 2.3915 1.5512 1.5786 1.6033 1.5981 2.0474 1.2679 1.5363 1.5731 2.2073 1.4196 1.4281 1.3392 2.6660 1.2596 1.2436 1.2570 5.5673 5.5905 1.3126 1.5181 6.5600 6.7273 5.8760 1.1967 1.2267 1.2292 1.2618 1.2684 3.0198 2.2820 2.2418 2.0937 2.0046 1.0492 1.0457 1.0433 1.0468 1.0550 1.1015 1.2337 1.2626 1.3778 1.3393 1.2436 1.8324 7.3030 5.7731 5.7411 6.4202 6.7212 6.7028 1.0376 1.0373 1.0371 1.0371 1.0349 1.0599 1.1018 1.0976 1.0969 1.0974 1.0976 1.1001 1.1012 1.0993 1.0992 1.0991 1.0988 1.0916 1.0915 1.0896 1.0896 1.0932 1.0932 1.0957 1.0928 1.0929 1.0955
irintensity: 0.4620 0.0823 0.0873 0.3465 0.3507 0.4377 0.5196 0.6314 0.6051 0.0410 0.4605 0.5671 0.2032 2.6354 0.1436 1.4304 4.8206 0.4220 3.0796 1.8823 4.5362 5.0418 5.1662 0.0934 0.4261 0.9918 0.5543 0.7441 2.0766 1.8776 12.8026 25.2471 24.2447 2.6695 0.0206 10.7788 41.5664 11.7132 59.1621 2.0283 1.4508 5.9983 7.5205 0.2237 0.9716 1.4316 7.8903 21.3399 6.5828 7.0725 45.3418 3.2547 13.2779 17.2030 51.8037 12.6983 309.2158 163.3781 2.5041 238.2435 36.0163 52.2373 40.7004 49.7882 0.6810 1.8044 4.2351 20.6890 280.6573 91.0602 8.9927 8.4825 0.6724 4.9750 0.7614 5.8756 6.2175 42.5295 188.8867 63.7479 3.3306 1.2829 39.5518 32.9885 0.4569 3.3219 24.1166 30.5212 19.6976 9.9450 98.0642 77.9946 117.3549 0.6574 0.9155 65.6548 10.7286 0.3894 0.3669 2.0729 119.1684 41.1255 0.9842 3.5288 0.9649 1.6237 0.4105 9.4674 11.4481 23.8562 7.6787 9.3100 1.7949 28.9132 14.5097 0.6998 1.1571 14.7444 19.6542 13.7043 7.0234 10.1229 7.4159 106.2716 62.8896 24.3837 15.5297 16.5580 126.8350 4.5223 192.2144 78.6072 8.4840 45.5033 55.9534 39.4593 44.3273 21.7421 25.5713 41.8547 41.5560 8.0724 15.8121 19.8624 15.6587 23.4013 65.4191 38.5442 20.4602 17.3425 18.9943 19.3498 23.1278 21.9442 15.6576 20.5561 0.3281 0.0125 1.8092 1.6234 1.9214 3.3884
temp: 298.150 k
press: 1.00000 atm
elementType: 15 8 8 8 8 6 6 6 6 6 6 6 6 6 6 6 6 6 6 6 6 6 6 6 6 6 6 6 6 1 1 1 1 1 1 1 1 1 1 1 1 1 1 1 1 1 1 1 1 1 1 1 1 1 1 1
symmnumber: 1
zpe: 1169989.4 jmol-1
zpe.correction: 0.445625 hartree
zpe.thermalcorrener: 0.474492 hartree
zpe.thermalcorrenthalpy: 0.475436 hartree
zpe.thermalcorrgfe: 0.378929 hartree
zpe.sumelectzpe: -1570.772133 hartree
zpe.sumelectthermal: -1570.743266 hartree
zpe.sumelectthermalent: -1570.742322 hartree
zpe.sumelectthermalfe: -1570.838830 hartree
dipole: 0.1451 0.1403 0.1027
dipole: 0.2265
quadrupole: -155.9531 -151.0049 -175.5284
quadrupole: 0.4275 -1.7770 -0.7350
quadrupole: 4.8757 9.8239 -14.6996 0.4275 -1.7770 -0.7350
hfenergy: -1571.2177586 hartree
pointgroup: C01 [X(C24H27O4P1)]
dipole: 0.0493598 -0.0643556 -0.0369056 debye
polarizability: 326.2523277|1.840656|337.0548845|21.217111|-7.3307216|265.4550885 unknown
InChI: InChI=1S/C24H27O4P/c1-6-21-7-9-22(10-8-21)26-29(25,27-23-13-17(2)11-18(3)14-23)28-24-15-19(4)12-20(5)16-24/h7-16H,6H2,1-5H3
charge 0 multiplicity 1
56 atoms
P  0.048169 -0.011154 0.07188
O  1.566707 0.383827 0.780627
O  -0.271935 -1.506797 0.87291
O  -0.990614 1.044732 0.960528
O  -0.071596 0.004522 -1.51098
C  2.347187 1.525927 0.393676
C  0.350685 -2.744535 0.489307
C  -5.179735 1.450311 0.30507
C  3.89616 3.24436 1.154004
C  1.370961 -4.813073 1.268195
C  3.301182 3.051181 -1.243363
C  0.967895 -4.433537 -1.148137
C  -2.395476 1.136247 0.689616
C  -6.670862 1.613014 0.046278
C  2.460347 1.946722 -0.943928
C  0.406304 -3.163192 -0.852311
C  3.045153 2.153613 1.444905
C  0.82236 -3.541341 1.551543
C  4.006836 3.683499 -0.192686
C  1.437885 -5.240512 -0.085252
C  -4.613878 0.167267 0.522495
C  -4.31147 2.57285 0.292867
C  -3.226841 -0.002521 0.721646
C  -2.919448 2.42595 0.476486
C  4.679841 3.931752 2.259164
C  1.891448 -5.700733 2.385893
C  3.439343 3.526098 -2.679856
C  1.045075 -4.909747 -2.588762
C  -7.023361 1.494176 -1.461422
H  -7.236113 0.845254 0.608548
H  -7.012377 2.597533 0.419228
H  1.905404 1.434267 -1.737448
H  0.027099 -2.51702 -1.651506
H  2.913917 1.78577 2.467029
H  0.756671 -3.160511 2.575257
H  4.65798 4.536006 -0.423921
H  1.866805 -6.22486 -0.312284
H  -5.267761 -0.712917 0.546955
H  -4.727268 3.575294 0.134608
H  -2.795941 -0.990955 0.912858
H  -2.243361 3.285956 0.464976
H  5.761514 3.712735 2.174481
H  4.565117 5.030136 2.209958
H  4.349053 3.599566 3.257869
H  2.979348 -5.874335 2.283578
H  1.71503 -5.250053 3.377182
H  1.400994 -6.691908 2.371519
H  2.452131 3.748398 -3.125226
H  3.912493 2.751234 -3.312233
H  4.056666 4.438269 -2.746543
H  1.620202 -4.201456 -3.213589
H  1.530048 -5.898128 -2.661722
H  0.037443 -4.992718 -3.037623
H  -6.498113 2.267122 -2.051162
H  -8.110318 1.615302 -1.622868
H  -6.722686 0.50821 -1.859712
