program: Gaussian 09
title: 000246478
version: EM64L-G09RevD.01
frameworkgroup: C1[X(C16H32N2O4)]
method: RPBEPBE
basis: SDD
operation: Freq
keyword: #p
keyword: freq=noraman
keyword: PBEPBE/SDD
title: #p freq=noraman PBEPBE/SDD
converged: YES YES NO NO
title: Mulliken charges:
elementType: O O O O N N C C C C C C C C C C C C C C C C H H H H H H H H H H H H H H H H H H H H H H H H H H H H H H H H
charge: -0.465656 -0.465657 -0.307142 -0.307142 -0.142760 -0.142759 -0.031458 -0.031463 -0.456162 -0.456162 -0.440342 -0.440328 -0.720763 -0.720759 -0.076355 -0.076366 -0.275684 -0.275675 -0.240512 -0.240534 -0.390545 -0.390521 0.230306 0.230312 0.232390 0.214722 0.232385 0.214723 0.234641 0.207250 0.207263 0.234617 0.218403 0.210294 0.228076 0.218405 0.210291 0.228077 0.203523 0.203532 0.225495 0.194125 0.194106 0.225506 0.356054 0.356049 0.190142 0.187084 0.190141 0.187093 0.204292 0.210581 0.210582 0.204285
chargesum: 0.00000
title: Mulliken charges with hydrogens summed into heavy atoms:
elementType: O O O O N N C C C C C C C C C C C C C C C C
charge: -0.109602 -0.109608 -0.307142 -0.307142 -0.142760 -0.142759 0.198848 0.198849 -0.009050 -0.009053 0.001548 0.001552 -0.063990 -0.063986 0.127168 0.127166 0.143936 0.143936 0.136713 0.136700 0.024329 0.024347
polarizability: 2.60013957e+02 -4.11106739e-04 1.89429956e+02 9.01584511e+00 -1.15154588e-03 1.66030695e+02
1716.lowfreq: -5.3085 -4.8885 -0.0014 -0.0007 -0.0005 6.6736 9.3511 12.5330 22.2400
frequency: 8.1461 12.5287 21.4703 27.5648 36.4618 49.9668 53.9757 66.2456 71.5654 82.0823 92.5261 94.1461 102.3780 119.6639 125.4309 149.2078 157.3438 161.9442 170.4308 196.5644 197.6954 227.3352 238.7372 288.7120 293.0524 298.3717 321.3595 348.6449 355.8838 388.9381 401.4010 420.7859 435.8704 455.5841 457.7003 481.2871 482.9759 498.8919 501.8558 552.8261 565.8745 712.8048 712.8222 760.6015 772.4246 772.4672 813.4057 854.6082 854.6837 865.1782 865.6143 898.5277 905.0761 923.3325 923.5871 930.4899 938.0025 942.0681 993.8962 994.0073 1026.0902 1037.1606 1038.9602 1048.4819 1056.7773 1059.8536 1060.7678 1072.4699 1073.5533 1074.7217 1085.8036 1086.5736 1098.2671 1099.2202 1102.3741 1111.3684 1118.6525 1136.8759 1154.4503 1158.0027 1158.5846 1158.7322 1170.7093 1184.5440 1187.1120 1222.0639 1223.4227 1243.5782 1249.3281 1250.1376 1251.8194 1258.3030 1261.0902 1279.1322 1282.4438 1303.6911 1310.2008 1321.2194 1322.4325 1340.7428 1357.1221 1360.1950 1379.5294 1379.5466 1395.0527 1395.2061 1399.5527 1399.5733 1411.4589 1411.6196 1461.1266 1461.3713 1462.9129 1462.9456 1465.8060 1465.8131 1471.9877 1471.9896 1473.5315 1475.0482 1475.1556 1478.0728 1489.2008 1495.9894 2911.7473 2911.7735 2921.1776 2921.2518 2943.8947 2944.0523 2955.8347 2955.8484 2969.8770 2970.6799 2979.5157 2979.5304 2986.0973 2994.8216 3026.7065 3026.7636 3035.9759 3039.9289 3039.9600 3047.2387 3047.2463 3056.9160 3056.9386 3064.9277 3068.9749 3069.0042 3092.3253 3092.3341 3164.2470 3164.2492 3514.9199 3515.0075
redmass: 4.0329 4.6483 5.0948 3.7788 4.1680 3.0628 3.6165 2.5014 3.1764 2.4524 4.2558 3.4349 4.0569 2.0046 2.9650 3.9245 2.9561 3.2725 3.3368 1.0870 1.1124 3.6848 3.6835 3.5110 2.7409 2.4452 3.3698 3.5085 4.3463 2.7207 2.6154 2.5955 2.5047 2.8355 2.7327 1.7313 1.5557 1.4895 1.7285 3.5202 3.4995 3.6581 3.6570 1.0702 3.7276 3.7274 1.1392 2.0565 2.0006 1.7753 1.8198 2.9316 2.6597 1.7792 1.7606 1.3292 2.7016 2.0080 1.2713 1.2696 5.0182 2.2183 1.9892 2.4484 1.8825 2.4754 5.2973 1.9572 1.3511 2.2211 2.0042 2.0094 1.9023 1.6180 1.9577 2.0541 2.3376 1.5130 1.4423 1.8415 1.9363 2.1395 1.3897 1.3522 1.2996 1.3056 1.3254 1.2534 1.6188 1.6150 1.2147 1.1813 1.2300 1.0590 1.1559 1.2064 1.2450 1.1843 1.1900 1.3870 1.3429 1.4189 1.4531 1.4524 1.5559 1.4638 1.5614 1.5631 1.7524 1.7307 1.0892 1.0879 1.0813 1.0814 1.0792 1.0793 1.1475 1.1478 1.0730 1.0494 1.0499 1.0838 1.0815 1.0899 1.0682 1.0682 1.0557 1.0550 1.0656 1.0657 1.0770 1.0769 1.1052 1.1055 1.0360 1.0360 1.0597 1.0587 1.1018 1.1018 1.1025 1.0927 1.0927 1.0800 1.0800 1.0639 1.0639 1.1050 1.0990 1.0990 1.0993 1.0993 1.1155 1.1155 1.0649 1.0649
irintensity: 0.0000 0.0174 0.1565 0.0242 1.9584 0.4632 0.5442 1.9003 2.9724 3.3746 1.4849 3.2649 0.1004 2.5333 2.4300 9.0295 1.8677 1.0445 4.2757 0.0164 0.1541 2.8774 0.0174 10.9064 17.5186 0.0467 1.2164 2.6897 2.5154 0.1422 0.2793 0.1785 6.9768 4.5587 36.0735 15.8714 117.7380 28.8175 125.1400 1.9921 27.9337 11.8183 0.1248 6.3414 26.7322 0.1228 0.0070 3.0618 1.5154 7.2237 11.5744 0.1312 18.8279 25.5989 0.0415 1.2181 34.1333 15.4247 6.7548 0.6356 188.3699 72.8796 49.6020 3.6965 8.1338 5.5282 3.1717 150.6122 4.0117 155.5602 4.0314 4.4133 0.0415 14.6252 2.5022 27.9720 9.3871 0.5074 9.6026 1.6264 6.9936 12.4454 0.9943 5.6860 24.3924 7.6934 0.8921 1.5563 27.1190 1.2958 14.0647 51.5625 14.2834 0.0092 0.1754 5.0776 41.4890 2.6468 37.8384 1.0694 8.9466 0.4292 7.3432 3.6082 11.3129 15.7193 6.9370 43.4871 9.4154 39.8065 30.0963 0.1660 15.3192 1.8589 12.5990 4.9911 7.5829 8.0084 0.0054 19.5913 0.4065 1.1152 0.1327 15.9497 71.7048 61.9222 1.6602 94.7389 57.5300 0.0308 53.3629 59.6817 78.6677 0.2089 1.7308 59.9492 0.6582 63.7327 6.0698 53.1537 0.0837 26.9630 65.6483 11.3331 36.8052 72.6651 6.5026 90.5019 69.4792 2.2212 6.0161 60.8704 19.9612 26.5561 43.4392 2.6685
temp: 298.150 k
press: 1.00000 atm
elementType: 8 8 8 8 7 7 6 6 6 6 6 6 6 6 6 6 6 6 6 6 6 6 1 1 1 1 1 1 1 1 1 1 1 1 1 1 1 1 1 1 1 1 1 1 1 1 1 1 1 1 1 1 1 1
symmnumber: 1
zpe: 1226748.4 jmol-1
zpe.correction: 0.467244 hartree
zpe.thermalcorrener: 0.494449 hartree
zpe.thermalcorrenthalpy: 0.495393 hartree
zpe.thermalcorrgfe: 0.403694 hartree
zpe.sumelectzpe: -1037.338296 hartree
zpe.sumelectthermal: -1037.311091 hartree
zpe.sumelectthermalent: -1037.310147 hartree
zpe.sumelectthermalfe: -1037.401846 hartree
dipole: -0.0002 2.6131 -0.0010
dipole: 2.6131
quadrupole: -120.0143 -138.5984 -140.6020
quadrupole: 0.0111 9.6246 0.0002
quadrupole: 13.0572 -5.5268 -7.5304 0.0111 9.6246 0.0002
hfenergy: -1037.80554 hartree
pointgroup: C01 [X(C16H32N2O4)]
dipole: -0.0001344 1.0280785 -0.0008144 debye
polarizability: 260.0017122|0.0258139|189.4299343|9.0793952|-0.0244942|166.0429626 unknown
InChI: InChI=1S/C16H32N2O4/c1-13-7-17(13)9-15(19)11-21-5-3-4-6-22-12-16(20)10-18-8-14(18)2/h13-16,19-20H,3-12H2,1-2H3
charge 0 multiplicity 1
54 atoms
O  -5.177879 -1.840162 1.563407
O  5.177506 -1.840299 -1.560155
O  -3.075579 -0.474662 0.408393
O  3.075064 -0.473688 -0.406818
N  -7.210706 0.371474 -0.650633
N  7.21037 0.375539 0.649639
C  -7.929215 1.47221 0.103995
C  7.928567 1.474925 -0.107257
C  -8.693381 0.5765 -0.859609
C  8.693073 0.581141 0.857863
C  -6.84031 -0.831734 0.1462
C  6.839938 -0.82924 -0.144802
C  -7.560321 2.903212 -0.237454
C  7.559593 2.906525 0.231589
C  -5.436904 -0.64961 0.740717
C  5.436366 -0.64843 -0.739324
C  -4.350859 -0.511699 -0.331775
C  4.350487 -0.509218 0.333174
C  -1.899523 -0.473672 -0.46979
C  1.899107 -0.472296 0.471503
C  -0.651239 -0.466891 0.417752
C  0.650766 -0.466949 -0.415968
H  -8.111573 1.273258 1.172438
H  8.110682 1.273981 -1.175368
H  -8.979823 0.956562 -1.84612
H  -9.381791 -0.164556 -0.42865
H  8.979709 0.963127 1.843576
H  9.381468 -0.160655 0.428158
H  -6.841125 -1.710109 -0.526071
H  -7.546609 -1.043662 0.982977
H  7.546047 -1.042688 -0.981352
H  6.841048 -1.706328 0.52915
H  -6.650402 3.218572 0.306153
H  -8.379288 3.596804 0.030389
H  -7.361157 2.999796 -1.318889
H  6.649525 3.220779 -0.312409
H  8.378433 3.599699 -0.037722
H  7.360651 3.005105 1.312885
H  -5.412266 0.260726 1.379305
H  5.411355 0.260933 -1.379279
H  -4.497984 0.411921 -0.92545
H  -4.366342 -1.39208 -1.011243
H  4.366383 -1.388587 1.013942
H  4.497443 0.415337 0.925434
H  -4.201979 -1.831847 1.753724
H  4.201565 -1.832527 -1.750291
H  -1.921888 0.425466 -1.124867
H  -1.91493 -1.375165 -1.123106
H  1.921154 0.427516 1.125662
H  1.91496 -1.373121 1.125727
H  -0.681777 -1.354628 1.079394
H  -0.688254 0.424812 1.07296
H  0.687319 0.424162 -1.072004
H  0.681728 -1.35528 -1.076795
