program: Gaussian 09
title: 000246477
version: EM64L-G09RevD.01
frameworkgroup: C1[X(C14H14N4S2)]
method: RPBEPBE
basis: SDD
operation: Freq
keyword: #p
keyword: freq=noraman
keyword: PBEPBE/SDD
title: #p freq=noraman PBEPBE/SDD
converged: YES YES NO NO
title: Mulliken charges:
elementType: S S N N N N C C C C C C C C C C C C C C H H H H H H H H H H H H H H
charge: 0.213522 0.271519 -0.191646 -0.027517 0.109952 0.072759 -0.543209 0.357967 0.477127 -0.123623 -0.235876 -0.360757 -0.367752 -0.391736 -0.455996 -0.231955 -0.220296 -0.237062 -0.810290 -0.828935 0.237836 0.255680 0.270544 0.248814 0.228841 0.232247 0.229696 0.232820 0.246020 0.278048 0.283023 0.268120 0.244143 0.267971
chargesum: 0.00000
title: Mulliken charges with hydrogens summed into heavy atoms:
elementType: S S N N N N C C C C C C C C C C C C C C
charge: 0.213522 0.271519 -0.191646 -0.027517 0.109952 0.072759 -0.049693 0.357967 0.477127 -0.123623 0.034668 -0.360757 -0.118937 -0.162895 -0.455996 0.000292 0.009401 -0.004242 -0.003199 -0.048702
polarizability: 2.67905495e+02 -3.59751955e+00 2.26949750e+02 2.08974526e+01 -5.61147218e+00 1.47857415e+02
1716.lowfreq: -8.6157 -4.6540 -0.0025 -0.0015 0.0013 1.3494 13.6557 21.8995 24.9611
frequency: 13.2058 21.7674 24.7983 49.7497 62.4644 87.2964 108.6870 116.7640 123.3315 142.1869 151.4717 188.2981 209.1422 219.2757 254.0422 269.1409 288.3773 317.8340 369.0615 374.7373 401.4434 425.4284 457.6467 539.2928 558.2076 579.6559 611.9776 621.8165 628.8456 661.3153 662.8809 676.3239 689.5436 703.3823 741.4943 781.4060 786.9546 797.6279 810.2999 836.6985 851.9411 902.0802 936.0392 968.8877 975.2894 977.1662 979.1921 989.0529 989.7873 993.1941 998.6293 1026.7388 1039.7808 1087.5832 1146.1156 1174.5428 1178.9671 1191.0849 1197.6041 1209.7122 1260.5114 1282.5188 1303.7625 1315.4985 1336.7727 1341.3389 1346.9347 1351.7222 1362.5496 1388.8503 1426.8061 1431.5070 1437.3742 1442.9162 1444.5001 1456.8967 1469.0785 1482.1676 1485.8866 1564.2983 1597.2851 1615.9095 2992.4265 3018.8955 3026.2984 3051.0645 3116.7710 3128.1884 3138.6682 3140.5405 3147.6675 3150.1987 3151.5527 3159.2623 3166.5090 3222.3216
redmass: 3.7384 6.1250 6.0470 3.3288 4.2669 4.6290 1.1218 3.9102 1.5284 4.5635 2.3688 4.0380 5.3401 5.2139 8.5268 2.8920 4.1016 6.3625 13.4854 8.0451 2.8033 4.7063 3.2883 8.0001 6.1062 8.1440 6.2498 7.3929 5.4962 7.1654 6.8474 11.6462 5.6690 2.0143 1.6668 7.4218 6.8777 4.9153 10.2599 1.4958 1.2557 1.3743 7.1038 2.0406 1.1787 1.3919 1.1775 1.2818 6.0687 1.3395 1.3411 2.2959 6.0428 1.5936 2.3396 1.0722 3.1280 1.1155 4.0101 2.1324 3.2000 6.6782 1.5129 3.5938 1.4032 1.5584 1.2481 1.8580 5.6043 4.8988 3.3591 1.0544 1.0537 2.1380 1.0552 1.0559 1.2249 9.7269 2.1468 9.2250 6.0938 5.9421 1.0619 1.0282 1.0279 1.1004 1.0879 1.0861 1.0911 1.1036 1.1057 1.0960 1.1044 1.1058 1.1016 1.0984
irintensity: 0.0697 0.1382 0.5675 0.1384 6.1657 0.7399 0.0133 0.3438 0.0421 1.6143 0.0268 3.8141 0.6208 0.2341 0.8514 2.5863 7.4854 2.5375 2.4491 0.4656 0.0948 0.2251 12.2657 0.4254 0.4244 1.3956 2.3298 10.1452 11.5004 1.8748 2.4408 0.2568 1.1648 40.0416 72.1114 11.2300 3.7141 7.4645 53.6283 18.1198 1.0054 2.5756 62.1883 6.0748 2.5288 0.1803 12.5371 8.5142 0.9140 2.1712 0.3816 11.6616 24.6304 9.8669 64.4348 1.5142 52.9201 3.7621 49.6478 26.1647 165.7882 50.7156 19.6026 63.7341 9.5926 7.1050 5.0341 31.4755 96.4915 3.8225 131.4266 4.2253 26.8085 6.4953 15.7212 42.5580 43.8890 379.7474 14.1680 82.3751 1.6300 5.6652 24.2378 22.9378 19.7655 4.2502 7.8963 0.8550 10.9743 15.1069 15.6655 31.4380 7.1123 9.3573 20.5641 1.2294
temp: 298.150 k
press: 1.00000 atm
elementType: 16 16 7 7 7 7 6 6 6 6 6 6 6 6 6 6 6 6 6 6 1 1 1 1 1 1 1 1 1 1 1 1 1 1
symmnumber: 1
zpe: 669506.3 jmol-1
zpe.correction: 0.255001 hartree
zpe.thermalcorrener: 0.274240 hartree
zpe.thermalcorrenthalpy: 0.275184 hartree
zpe.thermalcorrgfe: 0.203679 hartree
zpe.sumelectzpe: -1555.582263 hartree
zpe.sumelectthermal: -1555.563024 hartree
zpe.sumelectthermalent: -1555.562080 hartree
zpe.sumelectthermalfe: -1555.633585 hartree
dipole: -4.8841 5.4416 -1.6947
dipole: 7.5058
quadrupole: -127.3504 -134.2027 -125.4509
quadrupole: 18.1435 0.1003 2.5370
quadrupole: 1.6509 -5.2014 3.5505 18.1435 0.1003 2.5370
hfenergy: -1555.8372643 hartree
pointgroup: C01 [X(C14H14N4S2)]
dipole: 1.9311916 2.0894296 0.790662 debye
polarizability: 262.9049064|2.5358438|226.9721651|32.2799102|2.520933|152.8355886 unknown
InChI: InChI=1S/C14H14N4S2/c1-19-13-11-12(16-14(17-13)20-2)15-9-18(11)8-10-6-4-3-5-7-10/h3-7,9H,8H2,1-2H3
charge 0 multiplicity 1
34 atoms
S  -0.146196 2.114383 0.81636
S  -4.675849 0.029795 -1.476382
N  0.513632 -1.272921 0.968575
N  -0.86562 -2.978464 0.257658
N  -2.697679 -1.546781 -0.582575
N  -2.321449 0.855372 -0.304388
C  1.740184 -0.649335 1.496446
C  -0.625789 -0.657724 0.425458
C  2.712634 -0.155989 0.422379
C  -1.47701 -1.740951 -0.00956
C  0.304188 -2.650862 0.830857
C  -1.107588 0.663814 0.266387
C  2.747263 -0.729696 -0.871122
C  3.633509 0.8695 0.749562
C  -3.049005 -0.242762 -0.702748
C  3.694605 -0.286421 -1.821857
C  4.584291 1.308477 -0.197638
C  4.617798 0.730449 -1.488073
C  -1.344591 3.498684 0.39316
C  -4.771615 1.906354 -1.46599
H  2.234274 -1.41537 2.125194
H  1.460359 0.181853 2.168244
H  1.045846 -3.371869 1.172092
H  2.031406 -1.513023 -1.144952
H  3.602692 1.332487 1.744058
H  3.708906 -0.733174 -2.822144
H  5.28989 2.103973 0.066437
H  5.350704 1.073362 -2.226625
H  -0.829317 4.426321 0.686605
H  -2.277483 3.367606 0.958488
H  -1.552189 3.485359 -0.685256
H  -4.722456 2.281414 -0.434098
H  -5.745116 2.148434 -1.921239
H  -3.950126 2.329606 -2.061114
