program: Gaussian 09
title: 000246471
version: EM64L-G09RevD.01
frameworkgroup: C1[X(C14H12N2O2)]
method: RPBEPBE
basis: SDD
operation: Freq
keyword: #p
keyword: freq=noraman
keyword: PBEPBE/SDD
title: #p freq=noraman PBEPBE/SDD
converged: YES YES NO NO
title: Mulliken charges:
elementType: O O N N C C C C C C C C C C C C C C H H H H H H H H H H H H
charge: -0.405503 -0.230767 -0.112464 -0.118944 0.447712 -0.616839 -0.384853 -0.339729 0.158367 -0.288305 -0.342777 0.213087 0.177295 -0.294617 -0.339828 -0.200694 -0.203716 -0.235338 0.249812 0.243483 0.236202 0.261585 0.276203 0.252239 0.275699 0.251100 0.229431 0.231770 0.231352 0.379038
chargesum: 0.00000
title: Mulliken charges with hydrogens summed into heavy atoms:
elementType: O O N N C C C C C C C C C C C C C C
charge: -0.026465 -0.230767 -0.112464 -0.118944 0.447712 -0.123544 -0.148651 -0.078144 0.158367 -0.012102 -0.090539 0.213087 0.177295 -0.018917 -0.088728 0.028737 0.028054 -0.003986
polarizability: 3.89822815e+02 5.01817908e+00 1.64112971e+02 -1.76423029e+01 -3.76733917e-02 8.25868510e+01
1716.lowfreq: -4.0126 -0.0006 -0.0005 0.0005 2.2240 9.5596 18.2668 27.0332 36.3825
frequency: 18.0602 26.9821 36.3636 39.5589 65.5002 84.4289 117.0692 183.7813 201.0039 261.8200 274.0940 322.6954 365.6158 400.2624 406.1379 411.6262 468.7628 492.8472 515.1973 535.0862 550.7298 599.3065 609.3251 631.3346 646.5297 691.5022 698.6391 731.4814 781.8443 798.4934 825.6611 837.8610 850.3479 853.8573 883.0224 898.5776 931.1484 943.5075 980.6571 985.9548 988.1916 990.7150 1002.3747 1003.8288 1014.3768 1055.8577 1075.1187 1110.0484 1137.3940 1157.9799 1170.5273 1179.0026 1186.9505 1202.8278 1232.8574 1272.1746 1298.6831 1305.1302 1323.0192 1359.5605 1386.4069 1391.5989 1419.5438 1443.8517 1455.3736 1464.1085 1486.2496 1574.7149 1582.8797 1602.1697 1609.7635 1663.2337 3023.9432 3105.1484 3128.6868 3130.7937 3140.0718 3141.0198 3153.1528 3164.5600 3166.0402 3168.5701 3172.5788 3506.1971
redmass: 5.3863 4.9245 8.4599 4.6431 5.1188 6.4488 6.9807 6.5908 5.9487 5.9446 5.6733 4.3949 5.7292 2.3488 2.8805 2.9980 4.3752 3.0879 6.5181 4.2406 2.8364 2.9583 5.9917 6.4877 1.9579 1.9473 3.4261 3.6425 1.7655 4.3743 3.8419 3.2300 1.2502 1.2465 2.5468 6.8008 1.9946 1.4415 1.3776 6.2027 1.3721 1.3687 1.3267 2.7472 2.0756 1.9101 1.4930 1.3602 2.2751 1.2709 1.0609 1.2218 1.5344 2.3597 3.3476 1.4500 1.4005 1.4176 2.1371 6.8999 5.6480 8.1407 3.2092 2.3972 1.1161 2.1937 2.4721 6.8619 6.2357 6.2939 6.4038 8.5804 1.0614 1.1010 1.0852 1.0897 1.0888 1.0888 1.0930 1.0960 1.0960 1.0951 1.0999 1.0639
irintensity: 0.2485 1.1553 2.3074 0.4289 1.1620 0.4014 0.2967 0.3338 0.4674 0.9564 0.7229 1.0027 1.3702 6.3129 0.0283 0.1207 29.4456 3.5087 14.2125 25.1680 38.5983 37.0248 3.4310 9.3420 119.9720 55.0278 48.9381 10.3915 35.1086 6.2750 17.7184 39.1836 0.3827 0.0076 18.3371 2.1599 35.1121 7.4609 5.3795 1.2839 0.0812 2.0947 0.8484 12.7206 9.2703 223.0192 8.8380 43.5059 0.7280 44.5211 0.1457 25.7264 1.2635 7.5526 32.1720 1.9628 10.0957 1.7853 81.1688 3.0274 17.3487 2.5303 15.5156 7.8401 14.8255 5.2105 22.8976 2.7098 1.3386 2.3392 49.5488 226.4396 13.1427 4.7651 1.8955 16.5445 10.0437 6.4202 21.7322 7.4135 18.1316 6.4538 31.2717 25.2269
temp: 298.150 k
press: 1.00000 atm
elementType: 8 8 7 7 6 6 6 6 6 6 6 6 6 6 6 6 6 6 1 1 1 1 1 1 1 1 1 1 1 1
symmnumber: 1
zpe: 598754.6 jmol-1
zpe.correction: 0.228054 hartree
zpe.thermalcorrener: 0.243609 hartree
zpe.thermalcorrenthalpy: 0.244554 hartree
zpe.thermalcorrgfe: 0.181538 hartree
zpe.sumelectzpe: -799.348371 hartree
zpe.sumelectthermal: -799.332815 hartree
zpe.sumelectthermalent: -799.331871 hartree
zpe.sumelectthermalfe: -799.394887 hartree
dipole: -0.4286 -1.3569 -0.0739
dipole: 1.4249
quadrupole: -82.4919 -98.9885 -104.1897
quadrupole: -8.3138 -1.4579 -0.9884
quadrupole: 12.7314 -3.7651 -8.9663 -8.3138 -1.4579 -0.9884
hfenergy: -799.5764243 hartree
pointgroup: C01 [X(C14H12N2O2)]
dipole: 0.1368074 -0.2568267 -0.4791641 debye
polarizability: 389.0943799|2.5242475|96.1704832|-21.0503935|31.3628495|151.2577736 unknown
InChI: InChI=1S/C14H12N2O2/c17-14(18)10-11-6-8-13(9-7-11)16-15-12-4-2-1-3-5-12/h1-9,17H,10H2
charge 0 multiplicity 1
30 atoms
O  -5.761053 1.038298 -1.070357
O  -5.545644 1.483851 1.200018
N  1.105314 0.082867 0.59359
N  1.837489 -0.321551 -0.413317
C  -3.12307 -0.447882 0.326997
C  -4.640811 -0.627342 0.271268
C  -2.308498 -0.87317 -0.756911
C  -2.510533 0.146394 1.460396
C  -0.302345 -0.128121 0.426744
C  -0.911651 -0.720082 -0.715308
C  -1.112424 0.304307 1.509816
C  -5.350055 0.719749 0.230668
C  3.246243 -0.109513 -0.249169
C  3.85417 0.487446 0.892586
C  4.050471 -0.544874 -1.335433
C  5.25213 0.640412 0.932973
C  5.451522 -0.387642 -1.286659
C  6.055617 0.205026 -0.15296
H  -4.992284 -1.150863 1.178436
H  -4.928984 -1.214913 -0.613786
H  -2.780575 -1.325055 -1.637262
H  -3.132904 0.491815 2.293268
H  -0.274213 -1.04545 -1.542858
H  -0.620012 0.759448 2.375308
H  3.214749 0.815709 1.717634
H  3.553161 -0.999571 -2.198626
H  5.725457 1.099007 1.808528
H  6.069684 -0.724266 -2.125846
H  7.14366 0.328436 -0.112337
H  -6.183413 1.940629 -1.072299
