program: Gaussian 09
title: 000246469
version: EM64L-G09RevD.01
frameworkgroup: C1[X(C14H12N2O2)]
method: RPBEPBE
basis: SDD
operation: Freq
keyword: #p
keyword: freq=noraman
keyword: PBEPBE/SDD
title: #p freq=noraman PBEPBE/SDD
converged: YES YES NO NO
title: Mulliken charges:
elementType: O O N N C C C C C C C C C C C C C C H H H H H H H H H H H H
charge: -0.440292 -0.249614 -0.106899 -0.115658 0.442684 0.161651 -0.344328 -0.374488 0.175826 -0.288314 -0.334031 0.259161 -0.337913 -0.282478 -0.335703 -0.306237 -0.803012 0.112083 0.233926 0.236708 0.275729 0.251721 0.256316 0.278409 0.274143 0.274893 0.228533 0.241330 0.230662 0.385192
chargesum: 0.00000
title: Mulliken charges with hydrogens summed into heavy atoms:
elementType: O O N N C C C C C C C C C C C C C C
charge: -0.055100 -0.249614 -0.106899 -0.115658 0.442684 0.161651 -0.110402 -0.137780 0.175826 -0.012585 -0.082309 0.259161 -0.081598 -0.004069 -0.061560 -0.031344 -0.102487 0.112083
polarizability: 4.57893956e+02 9.24377920e+00 1.65063366e+02 9.05220376e-01 -5.24152074e-02 7.04100937e+01
1716.lowfreq: -15.1923 -7.9581 -3.1454 -0.0004 0.0007 0.0007 6.2548 22.6926 32.5520
frequency: -13.2492 22.6785 32.5512 54.8895 71.9967 77.2376 153.0493 157.7844 186.1137 194.6987 262.0376 307.7526 344.9900 361.2093 383.2991 408.6617 412.9592 470.1230 487.3333 518.6563 528.4699 539.4508 593.8898 608.7317 625.1786 635.3370 687.6793 716.0432 722.7161 770.5872 771.8928 826.8343 841.5960 849.6457 860.9976 884.7972 899.1946 974.4676 987.0711 992.6635 996.8207 998.5878 1003.0843 1008.1335 1017.3494 1044.6260 1106.5286 1114.5060 1134.6482 1151.3932 1161.2146 1190.7326 1221.7034 1238.9487 1292.1816 1298.5748 1320.8915 1347.8260 1373.9497 1388.4346 1396.6920 1418.9272 1422.7999 1467.9461 1472.6864 1478.8502 1488.9786 1568.5911 1573.4095 1610.2614 1614.4755 1637.9189 2976.4504 3057.8742 3087.1729 3125.2348 3131.9754 3153.2269 3161.1311 3162.4104 3168.1593 3172.7515 3181.8963 3531.8129
redmass: 1.0573 3.8661 5.9199 5.6096 6.7778 5.0125 6.1086 6.8991 5.4584 7.6619 4.5687 6.0660 2.9916 4.4645 7.1620 2.9161 3.0168 7.3494 2.7237 5.9855 5.8671 2.6451 1.2652 4.9451 7.1004 7.0402 3.5085 4.8298 3.0474 4.4887 4.7813 6.3989 1.4533 1.2717 1.2434 1.7074 7.2637 1.3534 1.4098 1.3572 3.8710 1.3657 2.6918 1.3583 2.9274 1.5864 1.3489 1.2783 2.0969 1.7184 1.3378 1.5292 2.5694 3.8616 1.3410 1.3420 2.7380 7.6327 4.7465 6.4206 1.2332 4.1227 3.9520 1.1127 1.0707 2.5399 2.6076 7.2213 6.4793 6.3481 6.3816 8.6470 1.0386 1.0949 1.0998 1.0897 1.0888 1.0883 1.0958 1.0880 1.0947 1.0971 1.0970 1.0641
irintensity: 0.8015 0.7483 0.0727 1.1376 0.9410 0.1531 0.2144 0.0375 0.0956 0.2799 0.6730 1.4843 0.3592 11.5718 25.0839 2.0323 0.2075 12.7264 1.4548 12.0040 10.8820 65.6066 61.5307 30.9157 0.4443 4.4009 85.0780 15.5780 15.5667 2.4421 1.1998 0.4961 36.1920 2.9076 0.4945 71.5179 2.0309 4.7363 1.8837 1.3225 158.1326 0.0079 7.7386 0.1347 235.8290 29.7105 12.2354 18.8188 104.1555 63.3571 104.7432 1.1355 3.4214 37.1774 17.2962 11.2640 170.7248 74.7700 4.4339 29.0574 10.4817 21.3877 9.7905 13.8080 13.4128 6.8925 9.1004 19.4750 24.1478 123.7113 27.9366 432.4368 30.7117 22.0434 16.9654 21.4269 23.0014 0.8624 13.4604 0.0098 7.3732 4.9264 2.0553 63.2165
temp: 298.150 k
press: 1.00000 atm
elementType: 8 8 7 7 6 6 6 6 6 6 6 6 6 6 6 6 6 6 1 1 1 1 1 1 1 1 1 1 1 1
symmnumber: 1
zpe: 596320.7 jmol-1
zpe.correction: 0.227127 hartree
zpe.thermalcorrener: 0.242239 hartree
zpe.thermalcorrenthalpy: 0.243183 hartree
zpe.thermalcorrgfe: 0.182699 hartree
zpe.sumelectzpe: -799.360419 hartree
zpe.sumelectthermal: -799.345306 hartree
zpe.sumelectthermalent: -799.344362 hartree
zpe.sumelectthermalfe: -799.404847 hartree
dipole: 3.8597 1.1757 0.0810
dipole: 4.0357
quadrupole: -83.9241 -96.0111 -108.5524
quadrupole: -10.8025 0.4039 -0.0277
quadrupole: 12.2384 0.1514 -12.3898 -10.8025 0.4039 -0.0277
hfenergy: -799.5875455 hartree
pointgroup: C01 [X(C14H12N2O2)]
dipole: 1.5126733 0.4818177 0.0249227 debye
polarizability: 457.5820763|12.8468275|165.122324|4.238451|-4.2952987|70.6630155 unknown
InChI: InChI=1S/C14H12N2O2/c1-10-2-6-12(7-3-10)15-16-13-8-4-11(5-9-13)14(17)18/h2-9,17H,1H3
charge 0 multiplicity 1
30 atoms
O  -5.836012 1.326861 -0.091864
O  -6.152786 -0.972064 -0.001111
N  1.086071 0.522489 -0.003371
N  0.348925 -0.560276 0.041751
C  5.337352 0.070302 0.065006
C  2.494554 0.287817 0.023698
C  4.512008 -1.090864 0.116073
C  4.708951 1.341332 -0.011491
C  -1.063176 -0.311883 0.017621
C  3.111479 -0.994934 0.097285
C  3.305215 1.452516 -0.03091
C  -3.880054 -0.072988 -0.017482
C  -1.878596 -1.475144 0.058337
C  -1.666321 0.978512 -0.040353
C  -3.278924 -1.357875 0.04067
C  -3.064445 1.092974 -0.057701
C  6.848258 -0.051552 0.110435
C  -5.363455 0.004181 -0.033945
H  4.986823 -2.078093 0.171124
H  5.326433 2.24594 -0.056813
H  2.474557 -1.883845 0.135436
H  2.808798 2.426763 -0.090428
H  -1.38633 -2.4516 0.103194
H  -1.018997 1.859522 -0.07047
H  -3.925079 -2.240797 0.071136
H  -3.54578 2.07383 -0.102106
H  7.341464 0.838101 -0.318212
H  7.204507 -0.156089 1.153799
H  7.199796 -0.939965 -0.443893
H  -6.830334 1.307529 -0.099812
