program: Gaussian 09
title: 000247737
version: EM64L-G09RevD.01
frameworkgroup: C1[X(C15H12N2O)]
method: RPBEPBE
basis: SDD
operation: Freq
keyword: #p
keyword: freq=noraman
keyword: PBEPBE/SDD
title: #p freq=noraman PBEPBE/SDD
converged: YES YES NO NO
title: Mulliken charges:
elementType: O N N C C C C C C C C C C C C C C C H H H H H H H H H H H H
charge: -0.258282 -0.031081 -0.043194 0.353632 0.265381 -0.357353 -0.360701 0.322840 -0.372573 -0.365145 -0.366621 0.173817 -0.313436 -0.203372 -0.173310 -0.369051 -0.216822 -0.536835 0.222739 0.256578 0.252725 0.245327 0.215826 0.232881 0.240842 0.234247 0.251208 0.226258 0.225512 0.247964
chargesum: 0.00000
title: Mulliken charges with hydrogens summed into heavy atoms:
elementType: O N N C C C C C C C C C C C C C C C
charge: -0.258282 -0.031081 -0.043194 0.353632 0.265381 -0.134614 -0.104123 0.322840 -0.119849 -0.119818 -0.150796 0.173817 -0.080554 0.037470 0.060938 -0.117842 -0.216822 0.162898
polarizability: 4.04187646e+02 -1.45831587e+01 1.82112610e+02 1.04518217e-01 2.54750258e-01 7.52546932e+01
1716.lowfreq: -4.2587 -0.0007 -0.0006 0.0005 4.2135 5.2788 22.5410 34.3672 55.2074
frequency: 22.4729 34.3611 55.2051 65.6152 89.3326 130.7355 145.1930 177.0106 199.5397 213.4123 245.4464 295.5415 303.6009 363.5318 369.2793 401.5847 406.2893 412.4711 489.7032 502.6935 533.1701 567.5444 610.0871 630.8188 639.2697 661.3451 737.3562 741.1441 749.5153 782.2261 787.4015 815.8756 835.6288 844.7756 883.0842 907.7238 954.0695 956.8160 962.2135 964.2974 983.9447 990.3243 997.8802 1008.9518 1037.1799 1092.5611 1113.4326 1124.9055 1159.5910 1166.3838 1189.3332 1207.4595 1245.9181 1278.1800 1298.5717 1315.3609 1318.5802 1345.7062 1382.5354 1408.9035 1432.9057 1437.9276 1453.9491 1467.9357 1472.5164 1503.7378 1544.3833 1569.9818 1571.0407 1603.6717 1622.8640 2158.8444 2966.1516 3056.9799 3128.4963 3130.1730 3131.9177 3135.7198 3144.3267 3145.6285 3151.8945 3168.9354 3172.2251 3172.6445
redmass: 3.6916 5.0657 5.6704 5.1567 4.0391 4.5635 7.5709 7.8662 3.0884 1.9766 1.9584 4.1906 4.7197 6.1589 6.3077 3.4199 7.2839 2.9876 3.3142 3.6983 2.6769 7.3720 7.1246 7.1417 6.4121 4.9558 3.5788 1.6397 6.4421 4.3359 2.5977 1.2765 2.0343 3.6512 1.3505 1.4798 1.5139 4.6380 1.4473 1.3780 8.2169 4.8823 1.3448 2.5708 2.3653 1.6333 1.2589 1.3729 1.3202 1.0778 1.3502 2.0161 2.4590 3.7943 2.1294 3.5031 1.5038 2.0051 3.0804 2.0110 3.7211 1.1709 2.3470 1.0504 1.0781 2.4256 5.4574 5.4945 6.5519 6.4619 6.3762 12.6420 1.0327 1.1042 1.0879 1.0999 1.0897 1.0892 1.0869 1.0886 1.0942 1.0947 1.0965 1.1007
irintensity: 3.2112 0.4098 0.0462 2.3731 0.3626 8.9314 3.8962 2.6334 0.4679 0.4145 0.1361 1.2619 5.5817 0.7382 0.7943 4.3771 12.1439 0.7808 10.8148 15.5940 31.7864 16.7772 4.1759 2.7000 0.5480 1.1959 1.6839 39.5073 10.9687 3.5109 15.8798 3.3344 66.8520 22.8856 8.7158 18.4046 0.5089 0.3878 2.9801 0.1239 62.1611 3.0189 0.2104 11.4037 1.5509 10.6132 0.1873 9.5748 4.4223 6.3368 243.2636 47.0391 163.4284 65.6510 2.5992 10.6621 0.5704 12.8025 2.3185 11.3724 28.8173 10.3472 63.1689 15.7170 58.2111 130.5777 46.2365 180.3520 9.4577 112.7463 96.8985 14.8249 89.9887 43.8561 18.4452 26.3029 11.1723 9.1791 3.2402 2.5950 24.2902 13.3420 22.1836 20.8888
temp: 298.150 k
press: 1.00000 atm
elementType: 8 7 7 6 6 6 6 6 6 6 6 6 6 6 6 6 6 6 1 1 1 1 1 1 1 1 1 1 1 1
symmnumber: 1
zpe: 601111.1 jmol-1
zpe.correction: 0.228951 hartree
zpe.thermalcorrener: 0.244695 hartree
zpe.thermalcorrenthalpy: 0.245640 hartree
zpe.thermalcorrgfe: 0.183960 hartree
zpe.sumelectzpe: -762.232560 hartree
zpe.sumelectthermal: -762.216816 hartree
zpe.sumelectthermalent: -762.215871 hartree
zpe.sumelectthermalfe: -762.277551 hartree
dipole: -0.8855 -3.9092 0.6504
dipole: 4.0607
quadrupole: -62.5178 -107.7764 -109.4640
quadrupole: -17.0004 -1.2609 1.3349
quadrupole: 30.7349 -14.5236 -16.2113 -17.0004 -1.2609 1.3349
hfenergy: -762.461511 hartree
pointgroup: C01 [X(C15H12N2O1)]
dipole: 0.3790721 1.390998 -0.6883092 debye
polarizability: 403.2084591|-11.7542719|144.8762381|17.5436573|-51.4190819|113.4702526 unknown
InChI: InChI=1S/C15H12N2O/c1-18-15-7-5-12(6-8-15)13(11-16)10-14-4-2-3-9-17-14/h2-10H,1H3
charge 0 multiplicity 1
30 atoms
O  5.337137 0.740053 -0.204679
N  -3.259204 -0.57781 0.448971
N  -0.8086 -2.359115 1.775856
C  1.165718 0.017821 0.203583
C  -0.301531 -0.205671 0.341697
C  1.703154 0.944735 -0.741184
C  2.087711 -0.696963 1.015995
C  3.983158 0.447275 -0.013818
C  3.082821 1.16031 -0.849449
C  3.478648 -0.49006 0.920757
C  -1.245841 0.645449 -0.202266
C  -2.702437 0.522691 -0.162192
C  -3.513651 1.536779 -0.753745
C  -4.916806 1.412662 -0.710973
C  -5.485652 0.281572 -0.080198
C  -4.611487 -0.68208 0.482907
C  -0.676041 -1.373467 1.109675
C  6.313855 0.01917 0.619205
H  1.040995 1.48935 -1.422168
H  1.711442 -1.425701 1.741742
H  3.493213 1.864162 -1.579568
H  4.147993 -1.06035 1.571069
H  -0.880295 1.537872 -0.723733
H  -3.042408 2.401963 -1.233333
H  -5.555097 2.181199 -1.15937
H  -6.569772 0.143926 -0.024207
H  -5.007262 -1.57487 0.980996
H  6.259251 -1.07205 0.441865
H  6.163176 0.230929 1.695166
H  7.29461 0.399417 0.299098
