program: Gaussian 09
title: 000247727
version: EM64L-G09RevD.01
frameworkgroup: C1[X(C8H13NO)]
method: RPBEPBE
basis: SDD
operation: Freq
keyword: #p
keyword: freq=noraman
keyword: PBEPBE/SDD
title: #p freq=noraman PBEPBE/SDD
converged: YES YES NO NO
title: Mulliken charges:
elementType: O N C C C C C C C C H H H H H H H H H H H H H
charge: -0.453944 -0.103710 -0.282493 -0.088828 -0.448074 -0.450586 0.386263 -0.397931 -0.402808 -0.817306 0.237923 0.212663 0.220627 0.245475 0.246826 0.208208 0.225341 0.196468 0.244911 0.224532 0.229645 0.235167 0.331630
chargesum: 0.00000
title: Mulliken charges with hydrogens summed into heavy atoms:
elementType: O N C C C C C C C C
charge: -0.122314 -0.103710 -0.044570 0.123835 0.018028 0.004448 0.386263 0.023879 -0.157897 -0.127963
polarizability: 9.62875793e+01 -1.82947246e+00 1.03786151e+02 -2.02849741e+00 4.85809428e+00 6.98829553e+01
1716.lowfreq: -7.2136 0.0006 0.0008 0.0011 12.1152 18.3032 56.2106 131.3473 160.2462
frequency: 56.1823 131.2724 160.2417 180.7107 233.8316 250.1674 277.9540 354.4733 388.6815 409.3577 507.9837 537.2542 593.1944 655.9624 678.3296 786.6110 835.1319 864.7242 887.1887 911.9948 926.1877 933.6121 963.8032 985.8420 1012.2002 1021.8958 1041.9699 1056.2385 1087.8737 1103.3085 1133.2167 1159.7309 1173.1539 1191.6404 1223.2165 1251.1076 1256.6534 1279.8435 1298.9594 1310.0280 1318.4253 1326.2894 1363.5350 1397.1072 1446.9093 1463.6177 1470.9659 1474.4712 1484.4221 1680.0205 2903.3738 2919.9426 2961.7603 2968.5708 2979.6668 3008.4596 3015.8850 3030.7834 3074.2943 3083.7964 3093.9466 3159.3117 3556.9209
redmass: 3.0402 2.7367 1.1736 2.8210 2.0698 1.3377 1.9309 3.9476 2.4369 2.0713 3.2729 3.7028 4.4411 2.9943 4.5833 1.2057 2.6533 4.0220 2.5171 2.8729 2.4935 2.6484 2.0862 1.7764 1.6466 1.7638 1.5854 2.0627 2.3951 2.1194 1.3271 1.2547 1.5290 1.3423 1.5766 1.4628 1.5908 1.3034 1.4159 1.3874 1.4164 2.2451 1.5154 1.2640 1.0975 1.0472 1.0683 1.0790 1.0839 6.9558 1.0688 1.0840 1.0381 1.0911 1.0836 1.0615 1.0659 1.0964 1.1031 1.0975 1.1034 1.0966 1.0660
irintensity: 0.6565 2.6816 1.2983 1.2479 1.3951 89.3507 63.2138 15.1810 3.1141 6.6209 5.1224 0.9069 18.3877 4.8568 3.9813 22.5106 1.2467 1.4243 16.7392 13.1634 36.0927 2.4649 31.4847 1.4806 16.3780 4.0258 4.6699 6.8628 3.3000 35.0960 47.0159 2.4759 6.2646 37.9585 4.1731 5.2146 2.8554 23.8276 6.8639 1.5663 2.1650 4.8577 8.0084 16.0384 13.5645 15.8892 9.0522 3.4608 9.9573 2.5750 94.1309 52.9959 38.6918 61.6440 49.4984 50.9252 29.9000 27.0196 21.2788 24.1945 33.1883 16.0099 3.6410
temp: 298.150 k
press: 1.00000 atm
elementType: 8 7 6 6 6 6 6 6 6 6 1 1 1 1 1 1 1 1 1 1 1 1 1
symmnumber: 1
zpe: 516154.0 jmol-1
zpe.correction: 0.196593 hartree
zpe.thermalcorrener: 0.206296 hartree
zpe.thermalcorrenthalpy: 0.207241 hartree
zpe.thermalcorrgfe: 0.161948 hartree
zpe.sumelectzpe: -441.798621 hartree
zpe.sumelectthermal: -441.788918 hartree
zpe.sumelectthermalent: -441.787974 hartree
zpe.sumelectthermalfe: -441.833266 hartree
dipole: -1.9129 -0.6990 1.1716
dipole: 2.3496
quadrupole: -63.6356 -55.4020 -62.3879
quadrupole: 3.0755 -0.3119 4.5854
quadrupole: -3.1604 5.0732 -1.9128 3.0755 -0.3119 4.5854
hfenergy: -441.9952141 hartree
pointgroup: C01 [X(C8H13N1O1)]
dipole: -0.7461936 -0.2890488 0.4627626 debye
dipolederiv: -0.5592058 0.3787109 0.1822176 0.3472801 -0.5846708 0.0138471 0.168401 0.0239306 -0.5184003 -0.5962134 0.040643 -0.0361492 0.0181377 -0.4779924 0.0209208 -0.0228168 0.1627476 -0.453777 -0.039145 0.0428542 0.0418113 0.0044492 0.2823505 0.0491302 -0.0394039 0.0857315 0.2760861 0.4377999 -0.1669617 -0.1696612 -0.2078349 0.4340673 0.1100332 -0.1386856 0.0729647 0.3538745 0.4747529 0.0346594 0.0299067 -0.0092318 0.2009638 -0.0345364 0.0837043 -0.0703263 0.2658406 -0.0143688 -0.0949088 -0.0683688 0.022958 -0.1079496 0.0504453 -0.0682395 0.0053111 -0.033906 0.1550527 0.0807929 -0.0543441 0.0287008 0.1825567 0.030506 -0.1434987 0.0430784 -0.1095789 0.3199109 -0.1947478 0.0493641 -0.2192221 0.1996078 0.0047608 0.0109202 0.0275541 0.3131974 -0.0736403 0.0576491 -0.1043723 0.0161288 -0.0235129 0.0277387 -0.0653737 0.0059174 -0.2289711 -0.0196847 -0.0528481 0.0203351 -0.0746216 -0.0610313 0.0134502 0.0460192 -0.0139124 0.09384 0.0052771 0.0494644 0.0131205 0.01449 -0.1166769 -0.1239958 0.0088069 -0.1658064 -0.1183919 -0.0309994 -0.039833 0.1053333 -0.0377915 -0.1070166 0.0909689 0.1020033 0.0762654 -0.0867643 0.056894 0.0152435 -0.0000298 -0.059988 -0.1533433 -0.0435148 -0.0468276 -0.0764005 0.057882 -0.1175559 -0.0143875 0.0824513 0.0581152 0.075118 -0.0132411 0.1020614 0.0191553 -0.051782 -0.1210993 0.0373587 -0.0912542 0.0476631 0.0927783 0.0237132 -0.0759929 0.0230322 0.0680678 0.0358832 0.028724 0.1312367 0.0182168 0.0177549 -0.0501986 0.0820891 -0.0275345 -0.0779302 -0.0339252 0.0756273 -0.049805 0.1189149 -0.1324547 0.0796944 -0.0502383 0.1405737 0.0042836 0.0027108 -0.1089786 -0.0709254 -0.0032863 -0.0491295 -0.0989419 -0.0156271 -0.1622095 -0.1250234 -0.0960411 0.0178141 0.09753 -0.0010501 0.0793677 -0.0062647 0.113892 -0.0169809 0.1438639 0.0340744 0.0923919 -0.0963921 0.0560448 -0.0501071 0.066011 -0.0600568 0.1146123 0.0280993 0.0952823 -0.0429738 0.0077345 -0.0337252 -0.0031298 -0.0708967 -0.0442858 -0.1303371 -0.0943421 -0.1221512 -0.0384072 0.0871889 0.0434002 0.0665336 -0.027526 0.102169 0.0089359 0.0686249 0.2063919 -0.1978869 -0.1069276 -0.1477481 0.2359162 -0.1121038 -0.0490195 -0.1463025 0.2252071 unknown
polarizability: 96.2582687|-1.761581|103.5354461|-2.3783289|5.6130041|70.162971 unknown
InChI: InChI=1S/C8H13NO/c1-6-2-4-9-5-3-7(10)8(6)9/h2,7-8,10H,3-5H2,1H3
charge 0 multiplicity 1
23 atoms
O  2.093101 -1.681147 -0.404376
N  0.200499 1.100665 -0.667699
C  -0.075437 -0.375184 -0.550925
C  1.053507 -0.980316 0.376434
C  1.56697 1.325743 -0.116285
C  1.7313 0.254254 0.998481
C  -1.485775 -0.462617 0.021383
C  -0.9157 1.848802 0.001361
C  -1.941202 0.780053 0.329709
C  -2.208359 -1.778509 0.152589
H  -0.011109 -0.877814 -1.541862
H  0.632666 -1.668464 1.137248
H  1.675352 2.363127 0.244039
H  2.318128 1.15372 -0.90843
H  2.779715 0.035663 1.26078
H  1.185974 0.560302 1.910699
H  -1.33299 2.625262 -0.672312
H  -0.569232 2.374871 0.92179
H  -2.927738 1.01081 0.743287
H  -1.636548 -2.498685 0.770755
H  -2.348724 -2.253593 -0.838891
H  -3.203566 -1.653459 0.612227
H  1.660766 -2.367383 -0.973504
