program: Gaussian 09
title: 000247726
version: EM64L-G09RevD.01
frameworkgroup: C1[X(C12H16N2O3)]
method: RPBEPBE
basis: SDD
operation: Freq
keyword: #p
keyword: freq=noraman
keyword: PBEPBE/SDD
title: #p freq=noraman PBEPBE/SDD
converged: YES YES NO NO
title: Mulliken charges:
elementType: O O O N N C C C C C C C C C C C C H H H H H H H H H H H H H H H H
charge: -0.218037 -0.220902 -0.221688 -0.370979 -0.377263 0.089431 -0.530180 -0.526737 0.177103 0.168164 -0.144275 -0.164586 0.152531 -0.182323 -0.169825 -0.736492 -0.739127 0.222645 0.256934 0.256914 0.237087 0.270309 0.240145 0.366572 0.363536 0.217858 0.228339 0.224883 0.229303 0.225514 0.225965 0.224074 0.225108
chargesum: 0.00000
title: Mulliken charges with hydrogens summed into heavy atoms:
elementType: O O O N N C C C C C C C C C C C C
charge: -0.218037 -0.220902 -0.221688 -0.004407 -0.013728 0.089431 -0.050601 -0.032736 0.177103 0.168164 0.126035 0.075559 0.152531 0.035535 0.058515 -0.056792 -0.063981
polarizability: 1.93564511e+02 -1.51922401e+01 1.44733883e+02 3.63998204e+00 1.20604549e+01 1.29963802e+02
1716.lowfreq: -11.1999 -8.4862 -5.8493 -0.0010 -0.0009 -0.0007 16.0447 36.3195 43.9283
frequency: 15.6265 36.3093 43.8681 47.8004 69.7182 108.6863 125.4138 136.6471 157.8523 183.1720 186.9810 193.1706 198.6878 219.0436 242.4654 270.7165 302.0409 323.3058 357.6049 374.2800 431.3152 458.7949 483.1635 492.9231 532.2833 594.3073 631.5146 659.1787 681.1719 710.9043 721.3712 760.1190 778.9465 790.6699 800.4152 843.0917 881.3445 913.2541 936.6215 971.6268 979.3257 986.4581 994.0887 1011.5582 1045.0734 1045.7722 1051.9305 1092.2028 1095.1013 1122.6335 1147.7704 1187.4204 1208.4017 1261.1838 1271.3918 1287.2612 1296.3557 1301.8076 1311.9883 1323.0241 1343.3669 1368.4011 1375.8480 1376.1958 1393.9893 1395.3384 1447.4874 1460.0774 1460.8379 1461.5652 1471.1017 1471.4587 1612.0790 1647.6733 1677.6429 1683.8281 1687.7884 2963.1649 2967.0655 2968.1257 3010.4763 3042.0111 3042.1206 3047.6938 3069.5123 3070.3986 3072.8089 3086.2311 3091.3055 3096.7122 3117.0257 3517.6810 3520.6391
redmass: 8.1574 3.6653 4.3363 2.4609 3.0783 1.8739 1.7086 5.0200 10.2098 2.0879 3.3774 1.4946 2.1714 2.9471 4.3833 3.1586 2.1834 2.2405 10.9732 10.5029 3.8481 4.8915 8.8984 2.8970 2.9077 7.9580 4.1064 2.4781 2.2770 4.2759 3.1438 1.7866 1.6767 1.7394 1.8603 2.2509 2.0513 1.7967 1.4871 4.3931 1.1050 1.2082 3.2317 1.7915 1.5506 1.5523 2.9757 3.4221 3.6336 2.2453 2.7184 2.5892 1.2297 1.6821 1.4642 1.3769 1.4734 1.2647 1.7849 1.3662 1.5152 8.4645 1.4920 2.1470 1.2386 1.2370 1.1046 1.0944 1.0474 1.0490 1.0580 1.0582 6.8234 8.6112 5.4690 5.9922 6.0589 1.0637 1.0365 1.0368 1.0590 1.0969 1.0969 1.0971 1.0921 1.0954 1.0956 1.1000 1.0983 1.0916 1.0900 1.0762 1.0776
irintensity: 1.1825 0.4932 0.2361 0.0991 1.0200 0.1503 0.5042 0.2331 13.8420 0.9695 0.6656 1.6167 3.2556 0.1603 0.3812 4.9016 0.5943 5.1299 25.5302 10.6035 3.5682 30.5173 15.6610 0.4103 4.0192 0.1713 3.8730 0.5930 35.4828 2.3428 2.6513 2.2190 35.8116 167.1113 19.9082 1.6566 2.0425 12.6525 20.9568 37.9562 46.1249 55.6988 7.3717 17.8609 0.2609 0.0912 15.7287 1.5428 1.7277 3.8720 0.7662 25.5597 2.4907 44.1589 75.8191 25.4258 72.9678 13.8652 154.6134 21.0515 68.4564 205.8740 5.1499 8.8200 10.7133 12.6366 27.6418 16.5013 11.5492 13.6277 20.3967 16.0832 294.6059 62.5652 639.0804 3.0498 7.2104 23.1784 38.6690 33.5719 7.8053 18.1408 29.9882 5.5224 3.1646 1.4767 7.7610 2.2564 35.8422 51.5960 14.2616 75.1287 52.3537
temp: 298.150 k
press: 1.00000 atm
elementType: 8 8 8 7 7 6 6 6 6 6 6 6 6 6 6 6 6 1 1 1 1 1 1 1 1 1 1 1 1 1 1 1 1
symmnumber: 1
zpe: 692068.4 jmol-1
zpe.correction: 0.263595 hartree
zpe.thermalcorrener: 0.281794 hartree
zpe.thermalcorrenthalpy: 0.282738 hartree
zpe.thermalcorrgfe: 0.215405 hartree
zpe.sumelectzpe: -800.787687 hartree
zpe.sumelectthermal: -800.769489 hartree
zpe.sumelectthermalent: -800.768544 hartree
zpe.sumelectthermalfe: -800.835878 hartree
dipole: -1.2536 0.7667 0.2707
dipole: 1.4942
quadrupole: -98.2191 -103.1491 -106.9824
quadrupole: 6.7519 -2.5939 -1.1062
quadrupole: 4.5645 -0.3656 -4.1989 6.7519 -2.5939 -1.1062
hfenergy: -801.0512823 hartree
pointgroup: C01 [X(C12H16N2O3)]
dipole: -0.4621223 -0.3406784 -0.1262937 debye
polarizability: 191.0628132|18.431716|147.5125504|-2.0096817|12.5212521|129.6868321 unknown
InChI: InChI=1S/C12H16N2O3/c1-3-5-7-12(8-6-4-2)9(15)13-11(17)14-10(12)16/h3-6,13-14H,7-8H2,1-2H3
charge 0 multiplicity 1
33 atoms
O  0.933744 -0.218561 -2.37382
O  -0.745191 0.569707 2.124364
O  2.729595 3.084296 0.353435
N  1.784101 1.420196 -0.989694
N  0.922187 1.843433 1.166708
C  -0.22662 0.098571 -0.23465
C  -1.591204 0.596262 -0.894866
C  -0.279309 -1.449286 0.008083
C  0.866457 0.39308 -1.276657
C  -0.048266 0.823165 1.106636
C  -2.84259 0.215299 -0.136221
C  0.967177 -1.997485 0.672662
C  1.872054 2.18234 0.186995
C  -3.851141 -0.520415 -0.674531
C  1.877882 -2.797417 0.05756
C  -5.1334 -0.883031 0.038456
C  3.115927 -3.367404 0.710923
H  -1.531843 1.699496 -1.004565
H  -1.616164 0.16649 -1.913249
H  -1.168295 -1.64312 0.63515
H  -0.438351 -1.926401 -0.975236
H  -2.9264 0.576061 0.897686
H  1.113444 -1.729104 1.730897
H  2.48454 1.630175 -1.708486
H  0.995091 2.359328 2.05007
H  -3.746922 -0.885875 -1.708918
H  1.714937 -3.062619 -0.998959
H  -6.01562 -0.480874 -0.496837
H  -5.147832 -0.490066 1.069906
H  -5.26449 -1.981729 0.085613
H  3.101367 -4.474676 0.692796
H  3.206643 -3.043067 1.762595
H  4.031095 -3.05387 0.171756
