program: Gaussian 09
title: 000247708
version: EM64L-G09RevD.01
frameworkgroup: C1[X(C7H14O6S)]
method: RPBEPBE
basis: SDD
operation: Freq
keyword: #p
keyword: freq=noraman
keyword: PBEPBE/SDD
title: #p freq=noraman PBEPBE/SDD
converged: YES YES NO NO
title: Mulliken charges:
elementType: S O O O O O O C C C C C C C H H H H H H H H H H H H H H
charge: 1.074041 -0.298949 -0.443799 -0.302884 -0.395504 -0.538928 -0.500630 -0.024197 -0.157731 -0.512775 -0.020201 -0.341234 -0.522005 -0.755375 0.234094 0.255717 0.275958 0.226849 0.241646 0.265860 0.258037 0.367307 0.289217 0.202234 0.233834 0.326438 0.284380 0.278600
chargesum: 0.00000
title: Mulliken charges with hydrogens summed into heavy atoms:
elementType: S O O O O O O C C C C C C C
charge: 1.074041 -0.298949 -0.076492 -0.302884 -0.395504 -0.538928 -0.500630 0.209898 0.097986 -0.009968 0.221445 0.182662 0.203280 0.134044
polarizability: 1.41666379e+02 3.31602368e+00 1.17745307e+02 1.44675235e+00 -2.34660163e-01 1.03833380e+02
1716.lowfreq: -17.6282 -9.1763 -2.0973 0.0011 0.0012 0.0017 45.1694 68.1109 79.1567
frequency: 44.9761 68.0962 79.1529 89.5579 128.9807 149.7304 166.7803 182.9818 190.7561 197.1298 230.1441 236.8635 252.0702 268.7515 313.4617 342.8039 350.5930 387.1296 425.4149 433.9264 474.6869 480.5137 517.6705 585.9455 653.3884 731.0748 747.8000 770.0708 795.9087 829.3613 832.9223 886.8049 913.8629 924.8930 934.9758 966.1416 989.7472 1000.0463 1017.9558 1037.4131 1058.5676 1063.8387 1106.1197 1130.2041 1146.6160 1174.2154 1200.1868 1224.1796 1248.2082 1280.3428 1299.0782 1306.0199 1315.0953 1321.9114 1324.7496 1359.0652 1411.4369 1414.0846 1419.7018 1435.8836 1440.3036 1443.7042 1463.8289 1494.9029 2961.4798 3007.7850 3014.7701 3017.4920 3025.9307 3042.6937 3066.9075 3077.4128 3086.5840 3120.2388 3122.9193 3164.6512 3183.4643 3383.7466
redmass: 4.6660 7.2308 5.7042 5.6651 3.6095 4.6989 1.8797 6.7818 3.9335 1.5906 1.7423 2.4881 2.5090 3.4829 5.6122 10.0744 6.2769 4.5923 2.2950 2.6465 4.5045 5.9818 5.0505 9.2259 1.0924 6.0046 3.6893 4.2442 4.2766 7.8869 4.1291 2.8583 6.8291 3.2954 2.7542 2.3180 3.3578 1.3702 2.7137 2.8309 1.7707 2.2753 2.4988 1.2645 1.3218 1.3724 1.3878 1.1179 1.5505 1.3507 1.4187 1.2340 1.1910 1.3082 1.2620 1.3382 1.1617 1.0505 1.0950 1.0625 1.1222 1.1000 1.0521 1.0540 1.0336 1.0614 1.0284 1.0790 1.0815 1.0696 1.1021 1.1033 1.0902 1.1030 1.1021 1.1087 1.1073 1.0657
irintensity: 0.7030 3.6233 2.5937 1.3578 8.7944 3.5998 6.7567 6.8024 4.0658 7.4972 2.9814 1.0828 0.2797 7.9562 4.6266 26.6411 15.3022 5.1756 2.3474 20.5410 5.6040 53.1806 7.3118 37.6609 146.6479 15.8146 15.3131 36.4049 65.0576 63.3708 15.7104 47.4436 78.4514 38.4857 27.6631 4.8848 99.5011 20.8968 18.4919 77.1168 87.4571 124.6480 3.2763 1.3744 18.1410 20.2668 3.6874 8.5026 6.9887 5.0134 3.9704 5.3485 2.5101 4.1439 13.2746 10.1108 24.0227 4.3750 50.5417 19.3695 9.7278 17.7078 5.5930 9.2521 65.3032 7.4020 16.1048 21.5699 25.6667 35.8998 16.4950 1.3591 39.0566 8.1808 12.7527 15.6247 0.6325 84.8963
temp: 298.150 k
press: 1.00000 atm
elementType: 16 8 8 8 8 8 8 6 6 6 6 6 6 6 1 1 1 1 1 1 1 1 1 1 1 1 1 1
symmnumber: 1
zpe: 568159.2 jmol-1
zpe.correction: 0.216400 hartree
zpe.thermalcorrener: 0.232256 hartree
zpe.thermalcorrenthalpy: 0.233200 hartree
zpe.thermalcorrgfe: 0.173658 hartree
zpe.sumelectzpe: -1123.203310 hartree
zpe.sumelectthermal: -1123.187454 hartree
zpe.sumelectthermalent: -1123.186510 hartree
zpe.sumelectthermalfe: -1123.246052 hartree
dipole: -3.4435 2.0444 5.2052
dipole: 6.5675
quadrupole: -105.2800 -86.2558 -90.3303
quadrupole: 3.7047 2.0908 -0.3246
quadrupole: -11.3246 7.6995 3.6251 3.7047 2.0908 -0.3246
hfenergy: -1123.41971 hartree
pointgroup: C01 [X(C7H14O6S1)]
dipole: 1.1798029 -0.0606707 2.2979701 debye
polarizability: 138.7156105|8.6377713|120.2063677|2.1985259|-1.8963252|104.3230872 unknown
InChI: InChI=1S/C7H14O6S/c1-11-7-3-5(8)6(13-7)4-12-14(2,9)10/h5-8H,3-4H2,1-2H3
charge 0 multiplicity 1
28 atoms
S  -2.559932 -0.605307 -0.579481
O  0.449845 0.339781 0.911226
O  2.173816 1.565344 -1.590119
O  2.328099 -0.814707 -0.126367
O  -2.00097 1.202327 -0.652959
O  -1.433154 -1.539724 -1.287765
O  -4.08536 -0.622529 -1.09682
C  0.313142 1.610278 0.106923
C  1.768729 2.029048 -0.262509
C  2.602989 1.35265 0.857963
C  1.882483 0.00596 0.997914
C  -0.603168 1.380365 -1.094902
C  1.685103 -2.144879 -0.202384
C  -2.50478 -0.845507 1.303258
H  -0.144233 2.353294 0.787653
H  1.878463 3.124036 -0.287611
H  3.659654 1.2409 0.572022
H  2.530058 1.9154 1.804633
H  2.011652 -0.541787 1.949806
H  -0.268374 0.511565 -1.691812
H  -0.616824 2.268599 -1.751597
H  2.333505 0.579919 -1.510604
H  0.611181 -2.046607 -0.440318
H  1.823704 -2.68834 0.753722
H  2.207056 -2.679992 -1.00998
H  -1.463944 -0.61872 1.577764
H  -3.222662 -0.120051 1.708759
H  -2.802379 -1.886917 1.490687
