program: Gaussian 09
title: 000247715
version: EM64L-G09RevD.01
frameworkgroup: C1[X(C13H18N4O4)]
method: RPBEPBE
basis: SDD
operation: Freq
keyword: #p
keyword: freq=noraman
keyword: PBEPBE/SDD
title: #p freq=noraman PBEPBE/SDD
converged: NO YES NO NO
title: Mulliken charges:
elementType: O O O O N N N N C C C C C C C C C C C C C H H H H H H H H H H H H H H H H H H
charge: -0.189486 -0.271163 -0.213664 -0.208220 -0.043249 -0.426538 0.022798 0.015381 -0.153979 -0.233481 0.236542 -0.709268 -0.709171 -0.681133 -0.680792 0.296455 0.258940 -0.293354 -0.498823 0.445786 -0.367928 0.200546 0.232902 0.221113 0.221320 0.232453 0.232471 0.220827 0.220850 0.230134 0.215730 0.230499 0.230228 0.215600 0.230584 0.346638 0.295423 0.335320 0.291711
chargesum: 0.00000
title: Mulliken charges with hydrogens summed into heavy atoms:
elementType: O O O O N N N N C C C C C C C C C C C C C
charge: -0.189486 -0.271163 -0.213664 -0.208220 -0.043249 -0.079900 0.022798 0.015381 0.046567 -0.000579 0.236542 -0.034382 -0.035023 -0.004769 -0.004380 0.296455 0.258940 0.002069 -0.163503 0.445786 -0.076217
polarizability: 3.68974738e+02 5.46577330e+00 2.25634131e+02 1.91185338e-02 -2.03021676e-01 1.08977462e+02
1716.lowfreq: -8.7091 -1.4817 -0.0005 0.0001 0.0005 4.7709 12.8633 21.9163 38.3604
frequency: 12.2812 21.1243 38.3559 56.0008 57.0757 59.9521 75.4745 114.0744 140.0542 155.7559 163.1329 184.4012 184.6565 210.3165 217.4867 223.7799 242.5432 250.2587 264.8551 305.7197 311.2114 332.7713 351.8416 378.7874 395.2333 400.3099 427.9147 449.5175 500.8338 513.4230 539.6602 563.4773 602.6767 639.2937 651.7957 676.3999 691.7155 705.5294 724.3287 736.6966 755.0445 815.8887 833.6543 861.3205 868.4643 890.8256 906.9126 918.1483 920.0100 955.9117 962.1711 963.2527 1000.6500 1011.1462 1017.0258 1051.0292 1087.6601 1098.0354 1109.5688 1115.7946 1134.5001 1159.3425 1166.3608 1172.6824 1211.9450 1221.2249 1233.4102 1281.4317 1293.9249 1299.8910 1327.4671 1333.1011 1351.3789 1365.1421 1369.9758 1382.2038 1383.7834 1394.7316 1402.9233 1450.8166 1461.1184 1467.4200 1469.7722 1472.5794 1475.7973 1479.2463 1482.8324 1486.1019 1490.5003 1512.6755 1573.2581 1579.4402 1624.6278 2981.1433 2982.7087 2984.1053 2985.1014 2991.8527 3004.9409 3074.6296 3078.9747 3080.7747 3084.4397 3085.3534 3088.5395 3089.9975 3096.7226 3179.5104 3188.8371 3201.2753 3233.7629
redmass: 3.0739 3.6278 5.3394 5.1183 5.2720 4.8833 9.3935 4.2746 5.1505 4.5787 5.2899 4.1960 4.6533 1.0430 1.1079 1.8803 1.0692 1.3675 3.2960 6.5101 6.2400 3.6910 3.0320 7.0125 4.6991 5.2422 3.3127 4.5652 8.9024 3.5700 3.0994 3.5429 4.7294 6.1204 7.8844 9.6262 5.0696 7.8232 4.8588 3.9633 9.8131 1.2086 5.1711 1.4229 2.7021 6.0985 2.4407 1.1710 1.1579 1.4381 1.4517 1.4060 1.9772 1.3132 2.3204 2.0687 2.6795 3.2724 1.9705 2.6711 1.3696 2.7038 1.9687 4.2095 4.0118 2.4438 2.0896 1.3400 1.9424 1.2986 1.6778 3.5566 3.0028 2.6208 1.1898 2.2810 1.1848 1.5904 1.2007 5.9846 1.0470 1.0494 1.0454 1.0475 1.0521 2.3377 1.0985 1.0611 1.0741 4.1911 5.5141 5.8806 7.4518 1.0346 1.0355 1.0349 1.0358 1.0826 1.0831 1.1005 1.0996 1.1004 1.1010 1.0996 1.1003 1.1007 1.0997 1.0896 1.0919 1.0959 1.0783
irintensity: 0.0129 0.5535 0.4940 0.2870 0.0109 0.3207 1.1505 2.1540 1.5807 0.6673 2.3904 2.6753 3.6295 0.0379 0.0512 0.7523 0.0796 0.5527 0.6862 1.2349 0.0592 0.1102 4.2275 0.0813 2.2561 1.2656 9.6943 1.4624 4.7180 12.4002 4.4180 25.1865 1.7269 2.8820 15.7655 7.4402 0.0024 7.5472 1.3284 0.2295 11.0510 76.3093 7.8772 23.8055 2.7700 9.4955 5.7871 7.0465 2.7592 0.3963 0.5139 23.7839 34.5055 0.0089 87.9055 35.5432 0.9985 62.2486 11.4485 3.1728 36.0167 165.0598 4.0129 234.9499 376.2814 67.4908 143.4642 0.0612 76.3407 0.1319 7.0293 225.8825 90.3086 37.3562 13.4820 18.2968 20.0361 15.7025 7.5504 1.0543 5.2819 2.4445 6.5433 0.5515 10.0385 23.1031 7.0220 6.7993 20.0166 158.6344 22.4929 158.5539 431.0924 28.4707 31.1440 30.9805 38.2801 10.2770 33.4750 14.5780 68.9467 0.0850 19.8350 41.6732 40.5703 4.1269 70.3425 3.2025 19.7638 0.0055 68.4697
temp: 298.150 k
press: 1.00000 atm
elementType: 8 8 8 8 7 7 7 7 6 6 6 6 6 6 6 6 6 6 6 6 6 1 1 1 1 1 1 1 1 1 1 1 1 1 1 1 1 1 1
symmnumber: 1
zpe: 799329.8 jmol-1
zpe.correction: 0.304449 hartree
zpe.thermalcorrener: 0.326136 hartree
zpe.thermalcorrenthalpy: 0.327081 hartree
zpe.thermalcorrgfe: 0.251248 hartree
zpe.sumelectzpe: -1024.322373 hartree
zpe.sumelectthermal: -1024.300685 hartree
zpe.sumelectthermalent: -1024.299741 hartree
zpe.sumelectthermalfe: -1024.375574 hartree
dipole: 9.5993 -1.7615 0.0237
dipole: 9.7596
quadrupole: -145.7211 -137.5345 -123.1130
quadrupole: -1.5093 0.0343 0.0887
quadrupole: -10.2649 -2.0783 12.3432 -1.5093 0.0343 0.0887
hfenergy: -1024.6268218 hartree
pointgroup: C01 [X(C13H18N4O4)]
dipole: 3.7974657 -0.5550155 -0.1217296 debye
polarizability: 366.6140981|6.8252918|216.7219949|-21.955821|-32.3829665|120.2502386 unknown
InChI: InChI=1S/C13H18N4O4/c1-8(2)13(9(3)4)15-14-11-6-5-10(16(18)19)7-12(11)17(20)21/h5-9,14H,1-4H3
charge 0 multiplicity 1
39 atoms
O  -2.402908 3.076123 -0.770793
O  -0.160867 2.68013 -0.821103
O  -4.871632 -2.400378 1.04921
O  -5.576578 -0.3007 0.48365
N  1.77898 -0.607796 -0.000406
N  0.764014 0.330137 -0.194282
N  -1.400364 2.284629 -0.610243
N  -4.648967 -1.181633 0.67171
C  4.062401 -1.356132 0.037745
C  3.528941 1.139339 -0.632058
C  3.032716 -0.24321 -0.19993
C  3.848838 -2.533528 -0.951439
C  4.021418 -1.851611 1.508192
C  4.263308 1.061755 -2.000266
C  4.440912 1.764885 0.461117
C  -0.544853 -0.030565 0.012791
C  -1.630148 0.90771 -0.182373
C  -0.885932 -1.360474 0.43349
C  -2.972521 0.525951 0.034822
C  -3.250451 -0.782175 0.444889
C  -2.208469 -1.733595 0.646608
H  5.065703 -0.92935 -0.151289
H  2.677139 1.833592 -0.768563
H  4.611009 -3.31655 -0.78528
H  3.922591 -2.20003 -2.002658
H  2.849504 -2.978135 -0.803139
H  3.02535 -2.265386 1.742177
H  4.777747 -2.641619 1.667148
H  4.226892 -1.030814 2.219342
H  4.592793 2.072031 -2.302792
H  5.159507 0.418543 -1.94322
H  3.603384 0.665243 -2.792212
H  4.766757 2.771075 0.141565
H  5.346933 1.156078 0.631205
H  3.907893 1.866895 1.423089
H  0.907957 1.314776 -0.494813
H  -0.063901 -2.063101 0.578445
H  -3.777274 1.249335 -0.118223
H  -2.471724 -2.74494 0.967183
